{"text_format":"1","workbook":"xlsx","n_sheets":15,"sheets":["KONCEPT ZAHRADA 14X1M","Regál 1","Regál 2","Regál 3","Regál 4","Regál 5","Regál 6","Regál 7","Regál 8","Regál 9","Regál 10","Regál 11","Regál 12","Regál 13","Regál 14"],"not_rendered":{"charts":0,"images":229,"macros":1,"external_links":1,"defined_names":29,"comments":0,"pivot_tables":0},"unopened":[],"bounds":{"document_bytes":16777216,"sheet_cells":100000,"rows_first":2000,"rows_last":500,"rows_between":2000,"halvings":0,"cell_chars":16384,"cell_head_chars":4096},"cells_cut":0,"cells_raw":0,"read":"whole","date_system":"1900"}

{"sheet":"KONCEPT ZAHRADA 14X1M","index":0,"n_rows":310,"n_cols":13,"rows_kept":310,"cut":false,"hidden":false,"merged":[[0,0,0,12]]}
["ZAHRADA 14 X 1M"]
[]
[null,null,"Specifikace",null,null,null,null,"rabat",0,null,"Prvky regálu a umístění produktu"]
["Poz.","Kat. číslo","Popis","MJ","Množství","Kat. cena\nks/bez DPH","Vaše nákupní cena","Celkem","Celkem po odečtení rabatu","Obrázek","Místo na regálu","Kat. číslo","Cílová pozici"]
[1,"S102081215","Hadice zahradní 1/2\" 15m STR STALCO GARDEN",{"$f":"VLOOKUP(B5,'[1]CENÍK 2023_01'!$C:$L,10,0)","v":"ks"},3,{"$f":"VLOOKUP(B5,'[1]CENÍK 2023_01'!$C:$P,14,0)","v":226.37024640000001},{"$f":"F5-(F5*$I$3)","v":226.37024640000001},{"$f":"F5*E5","v":679.11073920000001},{"$f":"H5-(H5*$I$3)","v":679.11073920000001},null,"R1.1","R-92625","POLICE"]
[2,"S102081220","Hadice zahradní 1/2\" 20m STR STALCO GARDEN",{"$f":"VLOOKUP(B6,'[1]CENÍK 2023_01'!$C:$L,10,0)","v":"ks"},3,{"$f":"VLOOKUP(B6,'[1]CENÍK 2023_01'!$C:$P,14,0)","v":301.82699520000006},301.82699520000006,{"$f":"F6*E6","v":905.48098560000017},{"$f":"H6-(H6*$I$3)","v":905.48098560000017},null,"R1.1","R-92625","POLICE"]
[3,"S102081230","Hadice zahradní 1/2\" 30m STR STALCO GARDEN",{"$f":"VLOOKUP(B7,'[1]CENÍK 2023_01'!$C:$L,10,0)","v":"ks"},3,{"$f":"VLOOKUP(B7,'[1]CENÍK 2023_01'!$C:$P,14,0)","v":452.74049280000003},{"$f":"F7-(F7*$I$3)","v":452.74049280000003},{"$f":"F7*E7","v":1358.2214784},{"$f":"H7-(H7*$I$3)","v":1358.2214784},null,"R1.1","R-92625","POLICE"]
[4,"S102081250","Hadice zahradní 1/2\" 50m STR STALCO GARDEN",{"$f":"VLOOKUP(B8,'[1]CENÍK 2023_01'!$C:$L,10,0)","v":"ks"},2,{"$f":"VLOOKUP(B8,'[1]CENÍK 2023_01'!$C:$P,14,0)","v":754.56748800000003},754.56748800000003,{"$f":"F8*E8","v":1509.1349760000001},{"$f":"H8-(H8*$I$3)","v":1509.1349760000001},null,"R1.2","R-92625","POLICE"]
[5,"S102083420","Hadice zahradní 3/4\" 20m STR STALCO GARDEN",{"$f":"VLOOKUP(B9,'[1]CENÍK 2023_01'!$C:$L,10,0)","v":"ks"},3,{"$f":"VLOOKUP(B9,'[1]CENÍK 2023_01'!$C:$P,14,0)","v":558.93888000000004},558.93888000000004,1676.81664,1676.81664,null,"R1.3","R-92625","POLICE"]
[6,"S102083430","Hadice zahradní 3/4\" 30m STR STALCO GARDEN",{"$f":"VLOOKUP(B10,'[1]CENÍK 2023_01'!$C:$L,10,0)","v":"ks"},3,{"$f":"VLOOKUP(B10,'[1]CENÍK 2023_01'!$C:$P,14,0)","v":838.40832000000012},838.40832000000012,2515.2249600000005,2515.2249600000005,null,"R1.3","R-92625","POLICE"]
[7,"S102083450","Hadice zahradní 3/4\" 50m STR STALCO GARDEN",{"$f":"VLOOKUP(B11,'[1]CENÍK 2023_01'!$C:$L,10,0)","v":"ks"},2,{"$f":"VLOOKUP(B11,'[1]CENÍK 2023_01'!$C:$P,14,0)","v":1397.3471999999999},{"$f":"F11-(F11*$I$3)","v":1397.3471999999999},2794.6943999999999,2794.6943999999999,null,"R1",null,"PODESTA"]
[8,"S102081010","Hadice zahradní 1\" 10m STR STALCO GARDEN",{"$f":"VLOOKUP(B12,'[1]CENÍK 2023_01'!$C:$L,10,0)","v":"ks"},1,{"$f":"VLOOKUP(B12,'[1]CENÍK 2023_01'!$C:$P,14,0)","v":449.01423360000001},449.01423360000001,{"$f":"F12*E12","v":449.01423360000001},{"$f":"H12-(H12*$I$3)","v":449.01423360000001},null,"R1",null,"PODESTA"]
[9,"S102081020","Hadice zahradní 1\" 20m STR STALCO GARDEN",{"$f":"VLOOKUP(B13,'[1]CENÍK 2023_01'!$C:$L,10,0)","v":"ks"},1,{"$f":"VLOOKUP(B13,'[1]CENÍK 2023_01'!$C:$P,14,0)","v":898.02846720000002},898.02846720000002,898.02846720000002,898.02846720000002,null,"R1",null,"PODESTA"]
[10,"S102061220","Hadice zahradní 1/2\" 20m EXP STALCO GARDEN",{"$f":"VLOOKUP(B14,'[1]CENÍK 2023_01'!$C:$L,10,0)","v":"ks"},3,{"$f":"VLOOKUP(B14,'[1]CENÍK 2023_01'!$C:$P,14,0)","v":454.60362239999995},454.60362239999995,1363.8108671999998,1363.8108671999998,null,"R1.2","R-92625","POLICE"]
[11,"S102061230","Hadice zahradní 1/2\" 30m EXP STALCO GARDEN",{"$f":"VLOOKUP(B15,'[1]CENÍK 2023_01'!$C:$L,10,0)","v":"ks"},3,{"$f":"VLOOKUP(B15,'[1]CENÍK 2023_01'!$C:$P,14,0)","v":681.90543360000004},681.90543360000004,2045.7163008000002,2045.7163008000002,null,"R1.2","R-92625","POLICE"]
[12,"S102061250","Hadice zahradní 1/2\" 50m EXP STALCO GARDEN",{"$f":"VLOOKUP(B16,'[1]CENÍK 2023_01'!$C:$L,10,0)","v":"ks"},3,{"$f":"VLOOKUP(B16,'[1]CENÍK 2023_01'!$C:$P,14,0)","v":1136.5090560000001},1136.5090560000001,3409.5271680000005,3409.5271680000005,null,"R1.3","R-92625","POLICE"]
[13,"S102063420","Hadice zahradní 3/4\" 20m EXP STALCO GARDEN",{"$f":"VLOOKUP(B17,'[1]CENÍK 2023_01'!$C:$L,10,0)","v":"ks"},3,{"$f":"VLOOKUP(B17,'[1]CENÍK 2023_01'!$C:$P,14,0)","v":674.45291520000001},674.45291520000001,2023.3587456,2023.3587456,null,"R1.3","R-92625","POLICE"]
[14,"S102063430","Hadice zahradní 3/4\" 30m EXP STALCO GARDEN",{"$f":"VLOOKUP(B18,'[1]CENÍK 2023_01'!$C:$L,10,0)","v":"ks"},3,{"$f":"VLOOKUP(B18,'[1]CENÍK 2023_01'!$C:$P,14,0)","v":1011.6793727999999},1011.6793727999999,3035.0381183999998,3035.0381183999998,null,"R1",null,"PODESTA"]
[15,"S102063450","Hadice zahradní 3/4\" 50m EXP STALCO GARDEN",{"$f":"VLOOKUP(B19,'[1]CENÍK 2023_01'!$C:$L,10,0)","v":"ks"},2,{"$f":"VLOOKUP(B19,'[1]CENÍK 2023_01'!$C:$P,14,0)","v":1686.1322879999998},1686.1322879999998,3372.2645759999996,3372.2645759999996,null,"R1",null,"PODESTA"]
[16,"S102041220","Hadice zahradní ATS 1/2\" 20m EXP STALCO GARDEN",{"$f":"VLOOKUP(B20,'[1]CENÍK 2023_01'!$C:$L,10,0)","v":"ks"},3,{"$f":"VLOOKUP(B20,'[1]CENÍK 2023_01'!$C:$P,14,0)","v":566.39139839999996},566.39139839999996,1699.1741951999998,1699.1741951999998,null,"R2.1","R-92625","POLICE"]
[17,"S102041230","Hadice zahradní ATS 1/2\" 30m EXP STALCO GARDEN",{"$f":"VLOOKUP(B21,'[1]CENÍK 2023_01'!$C:$L,10,0)","v":"ks"},3,{"$f":"VLOOKUP(B21,'[1]CENÍK 2023_01'!$C:$P,14,0)","v":849.58709759999999},849.58709759999999,2548.7612927999999,2548.7612927999999,null,"R2.1","R-92625","POLICE"]
[18,"S102041250","Hadice zahradní ATS 1/2\" 50m EXP STALCO GARDEN",{"$f":"VLOOKUP(B22,'[1]CENÍK 2023_01'!$C:$L,10,0)","v":"ks"},3,{"$f":"VLOOKUP(B22,'[1]CENÍK 2023_01'!$C:$P,14,0)","v":1415.9784960000002},1415.9784960000002,4247.935488000001,4247.935488000001,null,"R1.3","R-92625","POLICE"]
[19,"S102043420","Hadice zahradní ATS 3/4\" 20m EXP STALCO GARDEN",{"$f":"VLOOKUP(B23,'[1]CENÍK 2023_01'!$C:$L,10,0)","v":"ks"},3,{"$f":"VLOOKUP(B23,'[1]CENÍK 2023_01'!$C:$P,14,0)","v":894.30220799999995},894.30220799999995,2682.9066239999997,2682.9066239999997,null,"R2.1","R-92625","POLICE"]
[20,"S102043430","Hadice zahradní ATS 3/4\" 30m EXP STALCO GARDEN",{"$f":"VLOOKUP(B24,'[1]CENÍK 2023_01'!$C:$L,10,0)","v":"ks"},2,{"$f":"VLOOKUP(B24,'[1]CENÍK 2023_01'!$C:$P,14,0)","v":1341.4533119999999},1341.4533119999999,2682.9066239999997,2682.9066239999997,null,"R2",null,"PODESTA"]
[21,"S102043450","Hadice zahradní ATS 3/4\" 50m EXP STALCO GARDEN",{"$f":"VLOOKUP(B25,'[1]CENÍK 2023_01'!$C:$L,10,0)","v":"ks"},2,{"$f":"VLOOKUP(B25,'[1]CENÍK 2023_01'!$C:$P,14,0)","v":2235.7555200000002},2235.7555200000002,4471.5110400000003,4471.5110400000003,null,"R2",null,"PODESTA"]
[22,"S102021220","Hadice zahradní ATS 1/2\" 20m XTR STALCO GARDEN",{"$f":"VLOOKUP(B26,'[1]CENÍK 2023_01'!$C:$L,10,0)","v":"ks"},3,{"$f":"VLOOKUP(B26,'[1]CENÍK 2023_01'!$C:$P,14,0)","v":715.44176640000001},715.44176640000001,2146.3252991999998,2146.3252991999998,null,"R2.2","R-92625","POLICE"]
[23,"S102021230","Hadice zahradní ATS 1/2\" 30m XTR STALCO GARDEN",{"$f":"VLOOKUP(B27,'[1]CENÍK 2023_01'!$C:$L,10,0)","v":"ks"},3,{"$f":"VLOOKUP(B27,'[1]CENÍK 2023_01'!$C:$P,14,0)","v":1073.1626495999999},1073.1626495999999,3219.4879487999997,3219.4879487999997,null,"R2.2","R-92625","POLICE"]
[24,"S102021250","Hadice zahradní ATS 1/2\" 50m XTR STALCO GARDEN",{"$f":"VLOOKUP(B28,'[1]CENÍK 2023_01'!$C:$L,10,0)","v":"ks"},3,{"$f":"VLOOKUP(B28,'[1]CENÍK 2023_01'!$C:$P,14,0)","v":1788.6044159999999},1788.6044159999999,5365.8132479999995,5365.8132479999995,null,"R2.3","R-92625","POLICE"]
[25,"S102023420","Hadice zahradní ATS 3/4\" 20m XTR STALCO GARDEN",{"$f":"VLOOKUP(B29,'[1]CENÍK 2023_01'!$C:$L,10,0)","v":"ks"},3,{"$f":"VLOOKUP(B29,'[1]CENÍK 2023_01'!$C:$P,14,0)","v":1136.5090560000001},1136.5090560000001,3409.5271680000005,3409.5271680000005,null,"R2.2","R-92625","POLICE"]
[26,"S102023430","Hadice zahradní ATS 3/4\" 30m XTR STALCO GARDEN",{"$f":"VLOOKUP(B30,'[1]CENÍK 2023_01'!$C:$L,10,0)","v":"ks"},3,{"$f":"VLOOKUP(B30,'[1]CENÍK 2023_01'!$C:$P,14,0)","v":1704.763584},1704.763584,5114.2907519999999,5114.2907519999999,null,"R2",null,"PODESTA"]
[27,"S102023450","Hadice zahradní ATS 3/4\" 50m XTR STALCO GARDEN",{"$f":"VLOOKUP(B31,'[1]CENÍK 2023_01'!$C:$L,10,0)","v":"ks"},2,{"$f":"VLOOKUP(B31,'[1]CENÍK 2023_01'!$C:$P,14,0)","v":2841.2726400000001},2841.2726400000001,5682.5452800000003,5682.5452800000003,null,"R2",null,"PODESTA"]
[28,"S101010400","Rychlospojka průchozí 1/2\" STR STALCO GARDEN",{"$f":"VLOOKUP(B32,'[1]CENÍK 2023_01'!$C:$L,10,0)","v":"ks"},30,{"$f":"VLOOKUP(B32,'[1]CENÍK 2023_01'!$C:$P,14,0)","v":18.358993698847666},18.358993698847666,550.76981096543,550.76981096543,null,"R3.1","R-92625","POLICE"]
[29,"S101010403","Rychlospojka s funkcí stop 1/2\" STR STALCO GARDEN",{"$f":"VLOOKUP(B33,'[1]CENÍK 2023_01'!$C:$L,10,0)","v":"ks"},30,{"$f":"VLOOKUP(B33,'[1]CENÍK 2023_01'!$C:$P,14,0)","v":20.710089773867136},20.710089773867136,621.30269321601406,621.30269321601406,null,"R3.1","R-92625","POLICE"]
[30,"S101010406","Rychlospojka průchozí 3/4\" STR STALCO GARDEN",{"$f":"VLOOKUP(B34,'[1]CENÍK 2023_01'!$C:$L,10,0)","v":"ks"},30,{"$f":"VLOOKUP(B34,'[1]CENÍK 2023_01'!$C:$P,14,0)","v":22.754521143449278},22.754521143449278,682.63563430347835,682.63563430347835,null,"R3.1","R-92625","POLICE"]
[31,"S101010409","Rychlospojka s funkcí stop 3/4\" STR STALCO GARDEN",{"$f":"VLOOKUP(B35,'[1]CENÍK 2023_01'!$C:$L,10,0)","v":"ks"},30,{"$f":"VLOOKUP(B35,'[1]CENÍK 2023_01'!$C:$P,14,0)","v":24.79895251303142},24.79895251303142,743.96857539094265,743.96857539094265,null,"R3.1","R-92625","POLICE"]
[32,"S101010430","Spojka hadicová opravná 1/2\" STR STALCO GARDEN",{"$f":"VLOOKUP(B36,'[1]CENÍK 2023_01'!$C:$L,10,0)","v":"ks"},30,{"$f":"VLOOKUP(B36,'[1]CENÍK 2023_01'!$C:$P,14,0)","v":14.576795665120695},14.576795665120695,437.30386995362085,437.30386995362085,null,"R3.1","R-92625","POLICE"]
[33,"S101010433","Spojka hadicová opravná 3/4\" STR STALCO GARDEN",{"$f":"VLOOKUP(B37,'[1]CENÍK 2023_01'!$C:$L,10,0)","v":"ks"},30,{"$f":"VLOOKUP(B37,'[1]CENÍK 2023_01'!$C:$P,14,0)","v":18.665658404284986},18.665658404284986,559.96975212854954,559.96975212854954,null,"R3.1","R-92625","POLICE"]
[34,"S101010436","Spojka hadicová opravná 1/2\" - 3/4\" STR STALCO GARDEN",{"$f":"VLOOKUP(B38,'[1]CENÍK 2023_01'!$C:$L,10,0)","v":"ks"},30,{"$f":"VLOOKUP(B38,'[1]CENÍK 2023_01'!$C:$P,14,0)","v":18.665658404284986},18.665658404284986,559.96975212854954,559.96975212854954,null,"R3.1","R-92625","POLICE"]
[35,"S101010442","Konektor dvojitý STR STALCO GARDEN",{"$f":"VLOOKUP(B39,'[1]CENÍK 2023_01'!$C:$L,10,0)","v":"ks"},30,{"$f":"VLOOKUP(B39,'[1]CENÍK 2023_01'!$C:$P,14,0)","v":11.007072463018156},11.007072463018156,330.2121738905447,330.2121738905447,null,"R3.2","R-92625","POLICE"]
[36,"S101010445","Konektor trojitý STR STALCO GARDEN",{"$f":"VLOOKUP(B40,'[1]CENÍK 2023_01'!$C:$L,10,0)","v":"ks"},30,{"$f":"VLOOKUP(B40,'[1]CENÍK 2023_01'!$C:$P,14,0)","v":14.372352528162482},14.372352528162482,431.17057584487446,431.17057584487446,null,"R3.2","R-92625","POLICE"]
[37,"S101010448","Adaptér s vnitřním závitem 1/2\" STR STALCO GARDEN",{"$f":"VLOOKUP(B41,'[1]CENÍK 2023_01'!$C:$L,10,0)","v":"ks"},30,{"$f":"VLOOKUP(B41,'[1]CENÍK 2023_01'!$C:$P,14,0)","v":14.246766029745292},14.246766029745292,427.40298089235876,427.40298089235876,null,"R3.2","R-92625","POLICE"]
[38,"S101010451","Adaptér s vnitřním závitem 3/4\" STR STALCO GARDEN",{"$f":"VLOOKUP(B42,'[1]CENÍK 2023_01'!$C:$L,10,0)","v":"ks"},30,{"$f":"VLOOKUP(B42,'[1]CENÍK 2023_01'!$C:$P,14,0)","v":15.999135775101418},15.999135775101418,479.97407325304255,479.97407325304255,null,"R3.2","R-92625","POLICE"]
[39,"S101010454","Adaptér s vnitřním závitem 1\" STR STALCO GARDEN",{"$f":"VLOOKUP(B43,'[1]CENÍK 2023_01'!$C:$L,10,0)","v":"ks"},30,{"$f":"VLOOKUP(B43,'[1]CENÍK 2023_01'!$C:$P,14,0)","v":19.065782829474635},19.065782829474635,571.97348488423904,571.97348488423904,null,"R3.2","R-92625","POLICE"]
[40,"S101010457","Adaptér s vnitřním závitem 1/2\" - 3/4\" STR STALCO GARDEN",{"$f":"VLOOKUP(B44,'[1]CENÍK 2023_01'!$C:$L,10,0)","v":"ks"},30,{"$f":"VLOOKUP(B44,'[1]CENÍK 2023_01'!$C:$P,14,0)","v":19.503875265813665},19.503875265813665,585.1162579744099,585.1162579744099,null,"R3.2","R-92625","POLICE"]
[41,"S101010460","Adaptér s vnitřním závitem 3/4\" - 1\" STR STALCO GARDEN",{"$f":"VLOOKUP(B45,'[1]CENÍK 2023_01'!$C:$L,10,0)","v":"ks"},30,{"$f":"VLOOKUP(B45,'[1]CENÍK 2023_01'!$C:$P,14,0)","v":23.008614756525919},23.008614756525919,690.2584426957776,690.2584426957776,null,"R3.2","R-92625","POLICE"]
[42,"S101010463","Adaptér s vnějším závitem 1/2\" STR STALCO GARDEN",{"$f":"VLOOKUP(B46,'[1]CENÍK 2023_01'!$C:$L,10,0)","v":"ks"},30,{"$f":"VLOOKUP(B46,'[1]CENÍK 2023_01'!$C:$P,14,0)","v":9.1590525357280104},9.1590525357280104,274.77157607184029,274.77157607184029,null,"R3.2","R-92625","POLICE"]
[43,"S101010466","Adaptér s vnějším závitem 3/4\" STR STALCO GARDEN",{"$f":"VLOOKUP(B47,'[1]CENÍK 2023_01'!$C:$L,10,0)","v":"ks"},30,{"$f":"VLOOKUP(B47,'[1]CENÍK 2023_01'!$C:$P,14,0)","v":9.1590525357280104},9.1590525357280104,274.77157607184029,274.77157607184029,null,"R3.3","R-92625","POLICE"]
[44,"S101010472","Rozdělovač dvojitý s ventily STR STALCO GARDEN",{"$f":"VLOOKUP(B48,'[1]CENÍK 2023_01'!$C:$L,10,0)","v":"ks"},6,{"$f":"VLOOKUP(B48,'[1]CENÍK 2023_01'!$C:$P,14,0)","v":147.60188048067343},147.60188048067343,885.61128288404052,885.61128288404052,null,"R3","R-90265","HÁČEK"]
[45,"S101210412","Zavlažovací tryska, sada 4 ks 1/2\" STR STALCO GARDEN",{"$f":"VLOOKUP(B49,'[1]CENÍK 2023_01'!$C:$L,10,0)","v":"ks"},6,{"$f":"VLOOKUP(B49,'[1]CENÍK 2023_01'!$C:$P,14,0)","v":68.681491273983255},68.681491273983255,412.08894764389953,412.08894764389953,null,"R3","R-90265","HÁČEK"]
[46,"S101210415","Zavlažovací tryska, sada 4 ks 3/4\" STR STALCO GARDEN",{"$f":"VLOOKUP(B50,'[1]CENÍK 2023_01'!$C:$L,10,0)","v":"ks"},6,{"$f":"VLOOKUP(B50,'[1]CENÍK 2023_01'!$C:$P,14,0)","v":78.442931193537433},78.442931193537433,470.65758716122457,470.65758716122457,null,"R3","R-90265","HÁČEK"]
[47,"S101210430","Pistole zavlažovací nastavitelná STR STALCO GARDEN",{"$f":"VLOOKUP(B51,'[1]CENÍK 2023_01'!$C:$L,10,0)","v":"ks"},6,{"$f":"VLOOKUP(B51,'[1]CENÍK 2023_01'!$C:$P,14,0)","v":106.84412369608653},106.84412369608653,641.06474217651919,641.06474217651919,null,"R3","R-90265","HÁČEK"]
[48,"S101210433","Pistole zavlažovací 8 funkcí STR STALCO GARDEN",{"$f":"VLOOKUP(B52,'[1]CENÍK 2023_01'!$C:$L,10,0)","v":"ks"},4,{"$f":"VLOOKUP(B52,'[1]CENÍK 2023_01'!$C:$P,14,0)","v":129.8177218346917},129.8177218346917,519.27088733876678,519.27088733876678,null,"R3","R-90265","HÁČEK"]
[49,"S101410400","Zavlažovač na trnu STR STALCO GARDEN",{"$f":"VLOOKUP(B53,'[1]CENÍK 2023_01'!$C:$L,10,0)","v":"ks"},6,{"$f":"VLOOKUP(B53,'[1]CENÍK 2023_01'!$C:$P,14,0)","v":50.25402279671026},50.25402279671026,301.52413678026153,301.52413678026153,null,"R3","R-90265","HÁČEK"]
[50,"S101410412","Zavlažovač 8 funkcí na trnu STR STALCO GARDEN",{"$f":"VLOOKUP(B54,'[1]CENÍK 2023_01'!$C:$L,10,0)","v":"ks"},4,{"$f":"VLOOKUP(B54,'[1]CENÍK 2023_01'!$C:$P,14,0)","v":92.011332681717761},92.011332681717761,368.04533072687104,368.04533072687104,null,"R3","R-90265","HÁČEK"]
[51,"S101410415","Zavlažovač 8 funkcí na podstavci STR STALCO GARDEN",{"$f":"VLOOKUP(B55,'[1]CENÍK 2023_01'!$C:$L,10,0)","v":"ks"},4,{"$f":"VLOOKUP(B55,'[1]CENÍK 2023_01'!$C:$P,14,0)","v":18.688800000000001},18.688800000000001,74.755200000000002,74.755200000000002,null,"R3","R-90265","HÁČEK"]
[52,"S101410430","Zavlažovač otočný, 3ramnný na trnu STR STALCO GARDEN",{"$f":"VLOOKUP(B56,'[1]CENÍK 2023_01'!$C:$L,10,0)","v":"ks"},6,{"$f":"VLOOKUP(B56,'[1]CENÍK 2023_01'!$C:$P,14,0)","v":58.82243695523352},58.82243695523352,352.93462173140114,352.93462173140114,null,"R3","R-90265","HÁČEK"]
[53,"S101410451","Zavlažovač pulzující na trnu STR STALCO GARDEN S101410451",{"$f":"VLOOKUP(B57,'[1]CENÍK 2023_01'!$C:$L,10,0)","v":"ks"},5,{"$f":"VLOOKUP(B57,'[1]CENÍK 2023_01'!$C:$P,14,0)","v":80.297604778252747},80.297604778252747,401.48802389126377,401.48802389126377,null,"R3","R-90265","HÁČEK"]
[54,"S101410481","Zavlažovač vahadlový STR STALCO GARDEN",{"$f":"VLOOKUP(B58,'[1]CENÍK 2023_01'!$C:$L,10,0)","v":"ks"},3,{"$f":"VLOOKUP(B58,'[1]CENÍK 2023_01'!$C:$P,14,0)","v":323.16663579654511},323.16663579654511,969.49990738963538,969.49990738963538,null,"R3","R-90265","HÁČEK"]
[55,"S101010500","Rychlospojka průchozí 3/4\" STR HF STALCO GARDEN",{"$f":"VLOOKUP(B59,'[1]CENÍK 2023_01'!$C:$L,10,0)","v":"ks"},30,{"$f":"VLOOKUP(B59,'[1]CENÍK 2023_01'!$C:$P,14,0)","v":24.925999319569744},24.925999319569744,747.77997958709227,747.77997958709227,null,"R3.3","R-92625","POLICE"]
[56,"S101010503","Rychlospojka s funkcí stop 3/4\" STR HF STALCO GARDEN",{"$f":"VLOOKUP(B60,'[1]CENÍK 2023_01'!$C:$L,10,0)","v":"ks"},30,{"$f":"VLOOKUP(B60,'[1]CENÍK 2023_01'!$C:$P,14,0)","v":28.722800434508009},28.722800434508009,861.68401303524024,861.68401303524024,null,"R3.3","R-92625","POLICE"]
[57,"S101010506","Rychlospojka průchozí 1\" STR HF STALCO GARDEN",{"$f":"VLOOKUP(B61,'[1]CENÍK 2023_01'!$C:$L,10,0)","v":"ks"},20,{"$f":"VLOOKUP(B61,'[1]CENÍK 2023_01'!$C:$P,14,0)","v":56.249608517810479},56.249608517810479,1124.9921703562095,1124.9921703562095,null,"R3.3","R-92625","POLICE"]
[58,"S101010509","Rychlospojka s funkcí stop 1\" STR HF STALCO GARDEN",{"$f":"VLOOKUP(B62,'[1]CENÍK 2023_01'!$C:$L,10,0)","v":"ks"},20,{"$f":"VLOOKUP(B62,'[1]CENÍK 2023_01'!$C:$P,14,0)","v":58.14800907527961},58.14800907527961,1162.9601815055921,1162.9601815055921,null,"R3.3","R-92625","POLICE"]
[59,"S101010533","Spojka hadicová opravná 1\" STR HF STALCO GARDEN",{"$f":"VLOOKUP(B63,'[1]CENÍK 2023_01'!$C:$L,10,0)","v":"ks"},20,{"$f":"VLOOKUP(B63,'[1]CENÍK 2023_01'!$C:$P,14,0)","v":49.605206566668492},49.605206566668492,992.10413133336988,992.10413133336988,null,"R3.3","R-92625","POLICE"]
[60,"S101010536","Spojka hadicová opravná 3/4\" - 1\" STR HF STALCO GARDEN",{"$f":"VLOOKUP(B64,'[1]CENÍK 2023_01'!$C:$L,10,0)","v":"ks"},20,{"$f":"VLOOKUP(B64,'[1]CENÍK 2023_01'!$C:$P,14,0)","v":42.96080461552652},42.96080461552652,859.21609231053037,859.21609231053037,null,"R3.4","R-92625","POLICE"]
[61,"S101010542","Konektor dvojitý STR HF STALCO GARDEN",{"$f":"VLOOKUP(B65,'[1]CENÍK 2023_01'!$C:$L,10,0)","v":"ks"},30,{"$f":"VLOOKUP(B65,'[1]CENÍK 2023_01'!$C:$P,14,0)","v":23.027598762100606},23.027598762100606,690.82796286301823,690.82796286301823,null,"R3.4","R-92625","POLICE"]
[62,"S101010545","Konektor dvojitý s redukcí STR HF STALCO GARDEN",{"$f":"VLOOKUP(B66,'[1]CENÍK 2023_01'!$C:$L,10,0)","v":"ks"},30,{"$f":"VLOOKUP(B66,'[1]CENÍK 2023_01'!$C:$P,14,0)","v":21.413958288251841},21.413958288251841,642.41874864755528,642.41874864755528,null,"R3.4","R-92625","POLICE"]
[63,"S101010548","Konektor trojitý STR HF STALCO GARDEN",{"$f":"VLOOKUP(B67,'[1]CENÍK 2023_01'!$C:$L,10,0)","v":"ks"},20,{"$f":"VLOOKUP(B67,'[1]CENÍK 2023_01'!$C:$P,14,0)","v":32.519601549446286},32.519601549446286,650.39203098892574,650.39203098892574,null,"R3.4","R-92625","POLICE"]
[64,"S101010551","Konektor 3ramenný s redukcí STR HF STALCO GARDEN ",{"$f":"VLOOKUP(B68,'[1]CENÍK 2023_01'!$C:$L,10,0)","v":"ks"},20,{"$f":"VLOOKUP(B68,'[1]CENÍK 2023_01'!$C:$P,14,0)","v":26.159959681924683},26.159959681924683,523.19919363849363,523.19919363849363,null,"R3.4","R-92625","POLICE"]
[65,"S101010554","Adaptér s vnitřním závitem 1\" STR HF STALCO GARDEN",{"$f":"VLOOKUP(B69,'[1]CENÍK 2023_01'!$C:$L,10,0)","v":"ks"},20,{"$f":"VLOOKUP(B69,'[1]CENÍK 2023_01'!$C:$P,14,0)","v":23.027598762100606},23.027598762100606,460.55197524201213,460.55197524201213,null,"R3.4","R-92625","POLICE"]
[66,"S101010560","Adaptér s vnitřním závitem 3/4\" - 1\" STR HF STALCO GARDEN",{"$f":"VLOOKUP(B70,'[1]CENÍK 2023_01'!$C:$L,10,0)","v":"ks"},20,{"$f":"VLOOKUP(B70,'[1]CENÍK 2023_01'!$C:$P,14,0)","v":30.621200991977151},30.621200991977151,612.42401983954301,612.42401983954301,null,"R3.4","R-92625","POLICE"]
[67,"S101010566","Adaptér s vnějším závitem 3/4\" STR HF STALCO GARDEN",{"$f":"VLOOKUP(B71,'[1]CENÍK 2023_01'!$C:$L,10,0)","v":"ks"},30,{"$f":"VLOOKUP(B71,'[1]CENÍK 2023_01'!$C:$P,14,0)","v":14.484796253489501},14.484796253489501,434.54388760468504,434.54388760468504,null,"R3.4","R-92625","POLICE"]
[68,"S101610212","Naviják na hadici 45 m EXP STALCO GARDEN",{"$f":"VLOOKUP(B72,'[1]CENÍK 2023_01'!$C:$L,10,0)","v":"ks"},4,{"$f":"VLOOKUP(B72,'[1]CENÍK 2023_01'!$C:$P,14,0)","v":650.43404696015307},650.43404696015307,2601.7361878406123,2601.7361878406123,null,"R3",null,"PODESTA"]
[69,"S101010200","Rychlospojka průchozí 1/2\" EXP STALCO GARDEN",{"$f":"VLOOKUP(B73,'[1]CENÍK 2023_01'!$C:$L,10,0)","v":"ks"},6,{"$f":"VLOOKUP(B73,'[1]CENÍK 2023_01'!$C:$P,14,0)","v":46.721525475148567},46.721525475148567,280.32915285089143,280.32915285089143,null,"R4","R-90265","HÁČEK"]
[70,"S101010203","Rychlospojka s funkcí stop 1/2\" EXP STALCO GARDEN",{"$f":"VLOOKUP(B74,'[1]CENÍK 2023_01'!$C:$L,10,0)","v":"ks"},6,{"$f":"VLOOKUP(B74,'[1]CENÍK 2023_01'!$C:$P,14,0)","v":50.535527554752541},50.535527554752541,303.21316532851523,303.21316532851523,null,"R4","R-90265","HÁČEK"]
[71,"S101010206","Rychlospojka průchozí 3/4\" EXP STALCO GARDEN",{"$f":"VLOOKUP(B75,'[1]CENÍK 2023_01'!$C:$L,10,0)","v":"ks"},6,{"$f":"VLOOKUP(B75,'[1]CENÍK 2023_01'!$C:$P,14,0)","v":49.582027034851556},{"$f":"F75-(F75*$I$3)","v":49.582027034851556},297.49216220910932,297.49216220910932,null,"R4","R-90265","HÁČEK"]
[72,"S101010209","Rychlospojka s funkcí stop 3/4\" EXP STALCO GARDEN",{"$f":"VLOOKUP(B76,'[1]CENÍK 2023_01'!$C:$L,10,0)","v":"ks"},6,{"$f":"VLOOKUP(B76,'[1]CENÍK 2023_01'!$C:$P,14,0)","v":53.396029114455516},53.396029114455516,{"$f":"F76*E76","v":320.37617468673307},{"$f":"H76-(H76*$I$3)","v":320.37617468673307},null,"R4","R-90265","HÁČEK"]
[73,"S101010212","Rychlospojka s ventilem 1/2\" EXP STALCO GARDEN",{"$f":"VLOOKUP(B77,'[1]CENÍK 2023_01'!$C:$L,10,0)","v":"ks"},6,{"$f":"VLOOKUP(B77,'[1]CENÍK 2023_01'!$C:$P,14,0)","v":67.698536912970383},67.698536912970383,406.1912214778223,406.1912214778223,null,"R4","R-90265","HÁČEK"]
[74,"S101010215","Rychlospojka s ventilem 3/4\" EXP STALCO GARDEN",{"$f":"VLOOKUP(B78,'[1]CENÍK 2023_01'!$C:$L,10,0)","v":"ks"},6,{"$f":"VLOOKUP(B78,'[1]CENÍK 2023_01'!$C:$P,14,0)","v":69.605537952772366},69.605537952772366,417.63322771663422,417.63322771663422,null,"R4","R-90265","HÁČEK"]
[75,"S101010230","Spojka hadicová opravná 1/2\" EXP STALCO GARDEN",{"$f":"VLOOKUP(B79,'[1]CENÍK 2023_01'!$C:$L,10,0)","v":"ks"},6,{"$f":"VLOOKUP(B79,'[1]CENÍK 2023_01'!$C:$P,14,0)","v":42.812173343554505},42.812173343554505,256.87304006132706,256.87304006132706,null,"R4","R-90265","HÁČEK"]
[76,"S101010233","Spojka hadicová opravná 3/4\" EXP STALCO GARDEN",{"$f":"VLOOKUP(B80,'[1]CENÍK 2023_01'!$C:$L,10,0)","v":"ks"},6,{"$f":"VLOOKUP(B80,'[1]CENÍK 2023_01'!$C:$P,14,0)","v":53.682079270425803},53.682079270425803,322.09247562255484,322.09247562255484,null,"R4","R-90265","HÁČEK"]
[77,"S101010236","Spojka hadicová opravná 1/2\" - 3/4\" EXP STALCO GARDEN",{"$f":"VLOOKUP(B81,'[1]CENÍK 2023_01'!$C:$L,10,0)","v":"ks"},6,{"$f":"VLOOKUP(B81,'[1]CENÍK 2023_01'!$C:$P,14,0)","v":49.772727138831748},49.772727138831748,298.63636283299047,298.63636283299047,null,"R4","R-90265","HÁČEK"]
[78,"S101010242","Konektor dvojitý EXP STALCO GARDEN",{"$f":"VLOOKUP(B82,'[1]CENÍK 2023_01'!$C:$L,10,0)","v":"ks"},6,{"$f":"VLOOKUP(B82,'[1]CENÍK 2023_01'!$C:$P,14,0)","v":21.551227251638071},21.551227251638071,129.30736350982843,129.30736350982843,null,"R4","R-90265","HÁČEK"]
[79,"S101010245","Konektor trojitý EXP STALCO GARDEN",{"$f":"VLOOKUP(B83,'[1]CENÍK 2023_01'!$C:$L,10,0)","v":"ks"},6,{"$f":"VLOOKUP(B83,'[1]CENÍK 2023_01'!$C:$P,14,0)","v":24.982951336293819},24.982951336293819,149.89770801776291,149.89770801776291,null,"R4","R-90265","HÁČEK"]
[80,"S101010251","Adaptér s vnitřním závitem 3/4\" EXP STALCO GARDEN",{"$f":"VLOOKUP(B84,'[1]CENÍK 2023_01'!$C:$L,10,0)","v":"ks"},6,{"$f":"VLOOKUP(B84,'[1]CENÍK 2023_01'!$C:$P,14,0)","v":28.891065753000035},28.891065753000035,173.34639451800021,173.34639451800021,null,"R4","R-90265","HÁČEK"]
[81,"S101010254","Adaptér s vnitřním závitem 1\" EXP STALCO GARDEN",{"$f":"VLOOKUP(B85,'[1]CENÍK 2023_01'!$C:$L,10,0)","v":"ks"},6,{"$f":"VLOOKUP(B85,'[1]CENÍK 2023_01'!$C:$P,14,0)","v":29.939916324891122},29.939916324891122,179.63949794934672,179.63949794934672,null,"R4","R-90265","HÁČEK"]
[82,"S101010257","Adaptér s vnitřním závitem 1/2\" - 3/4\" EXP STALCO GARDEN",{"$f":"VLOOKUP(B86,'[1]CENÍK 2023_01'!$C:$L,10,0)","v":"ks"},6,{"$f":"VLOOKUP(B86,'[1]CENÍK 2023_01'!$C:$P,14,0)","v":32.8957679365842},32.8957679365842,197.37460761950518,197.37460761950518,null,"R4","R-90265","HÁČEK"]
[83,"S101010260","Adaptér s vnitřním závitem 3/4\" - 1\" EXP STALCO GARDEN",{"$f":"VLOOKUP(B87,'[1]CENÍK 2023_01'!$C:$L,10,0)","v":"ks"},6,{"$f":"VLOOKUP(B87,'[1]CENÍK 2023_01'!$C:$P,14,0)","v":38.807471159970348},38.807471159970348,232.84482695982209,232.84482695982209,null,"R4","R-90265","HÁČEK"]
[84,"S101010263","Adaptér s vnějším závitem 1/2\" EXP STALCO GARDEN",{"$f":"VLOOKUP(B88,'[1]CENÍK 2023_01'!$C:$L,10,0)","v":"ks"},6,{"$f":"VLOOKUP(B88,'[1]CENÍK 2023_01'!$C:$P,14,0)","v":17.268143532363478},17.268143532363478,103.60886119418086,103.60886119418086,null,"R4","R-90265","HÁČEK"]
[85,"S101010266","Adaptér s vnějším závitem 3/4\" EXP STALCO GARDEN",{"$f":"VLOOKUP(B89,'[1]CENÍK 2023_01'!$C:$L,10,0)","v":"ks"},6,{"$f":"VLOOKUP(B89,'[1]CENÍK 2023_01'!$C:$P,14,0)","v":18.994957885599824},18.994957885599824,113.96974731359894,113.96974731359894,null,"R4","R-90265","HÁČEK"]
[86,"S101010272","Rozdělovač dvojitý EXP STALCO GARDEN",{"$f":"VLOOKUP(B90,'[1]CENÍK 2023_01'!$C:$L,10,0)","v":"ks"},4,{"$f":"VLOOKUP(B90,'[1]CENÍK 2023_01'!$C:$P,14,0)","v":193.6145029401811},193.6145029401811,774.45801176072439,774.45801176072439,null,"R4","R-90265","HÁČEK"]
[87,"S101010275","Rozdělovač 4ramenný EXP STALCO GARDEN",{"$f":"VLOOKUP(B91,'[1]CENÍK 2023_01'!$C:$L,10,0)","v":"ks"},4,{"$f":"VLOOKUP(B91,'[1]CENÍK 2023_01'!$C:$P,14,0)","v":324.18534211581363},324.18534211581363,1296.7413684632545,1296.7413684632545,null,"R4","R-90265","HÁČEK"]
[88,"S101010281","Hodiny s průtokem vody EXP STALCO GARDEN",{"$f":"VLOOKUP(B92,'[1]CENÍK 2023_01'!$C:$L,10,0)","v":"ks"},3,{"$f":"VLOOKUP(B92,'[1]CENÍK 2023_01'!$C:$P,14,0)","v":354.65492126471736},354.65492126471736,1063.9647637941521,1063.9647637941521,null,"R4","R-90265","HÁČEK"]
[89,"S101210200","Tryska nastavitelná EXP STALCO GARDEN",{"$f":"VLOOKUP(B93,'[1]CENÍK 2023_01'!$C:$L,10,0)","v":"ks"},6,{"$f":"VLOOKUP(B93,'[1]CENÍK 2023_01'!$C:$P,14,0)","v":47.763124071254502},47.763124071254502,286.578744427527,286.578744427527,null,"R4","R-90265","HÁČEK"]
[90,"S101210212","Zavlažovací tryska 1/2\", sada 4 ks EXP STALCO GARDEN",{"$f":"VLOOKUP(B94,'[1]CENÍK 2023_01'!$C:$L,10,0)","v":"ks"},6,{"$f":"VLOOKUP(B94,'[1]CENÍK 2023_01'!$C:$P,14,0)","v":179.24896562373098},179.24896562373098,1075.4937937423858,1075.4937937423858,null,"R4","R-90265","HÁČEK"]
[91,"S101210215","Zavlažovací tryska 3/4\", sada 4 ks EXP STALCO GARDEN",{"$f":"VLOOKUP(B95,'[1]CENÍK 2023_01'!$C:$L,10,0)","v":"ks"},6,{"$f":"VLOOKUP(B95,'[1]CENÍK 2023_01'!$C:$P,14,0)","v":192.60800032565274},192.60800032565274,1155.6480019539165,1155.6480019539165,null,"R4","R-90265","HÁČEK"]
[92,"S101210230","Pistole zavlažovací nastavitelná EXP STALCO GARDEN",{"$f":"VLOOKUP(B96,'[1]CENÍK 2023_01'!$C:$L,10,0)","v":"ks"},6,{"$f":"VLOOKUP(B96,'[1]CENÍK 2023_01'!$C:$P,14,0)","v":201.20902266798589},201.20902266798589,1207.2541360079153,1207.2541360079153,null,"R4","R-90265","HÁČEK"]
[93,"S101210233","Pistole zavlažovací 7-funkcí EXP STALCO GARDEN",{"$f":"VLOOKUP(B97,'[1]CENÍK 2023_01'!$C:$L,10,0)","v":"ks"},4,{"$f":"VLOOKUP(B97,'[1]CENÍK 2023_01'!$C:$P,14,0)","v":205.96703502757447},205.96703502757447,823.86814011029787,823.86814011029787,null,"R4","R-90265","HÁČEK"]
[94,"S101210251","Pistole zavlažovací nastavitelná, kovová EXP STALCO GARDEN",{"$f":"VLOOKUP(B98,'[1]CENÍK 2023_01'!$C:$L,10,0)","v":"ks"},6,{"$f":"VLOOKUP(B98,'[1]CENÍK 2023_01'!$C:$P,14,0)","v":173.91849482994081},173.91849482994081,1043.510968979645,1043.510968979645,null,"R4","R-90265","HÁČEK"]
[95,"S101210254","Pistole zavlažovací 7 funkcí, kovová EXP STALCO GARDEN",{"$f":"VLOOKUP(B99,'[1]CENÍK 2023_01'!$C:$L,10,0)","v":"ks"},4,{"$f":"VLOOKUP(B99,'[1]CENÍK 2023_01'!$C:$P,14,0)","v":170.73944351908222},170.73944351908222,682.95777407632886,682.95777407632886,null,"R4","R-90265","HÁČEK"]
[96,"S101410215","Zavlačovač s 8 funkcemi na podstavci EXP STALCO GARDEN",{"$f":"VLOOKUP(B100,'[1]CENÍK 2023_01'!$C:$L,10,0)","v":"ks"},5,{"$f":"VLOOKUP(B100,'[1]CENÍK 2023_01'!$C:$P,14,0)","v":170.81464919389126},170.81464919389126,854.07324596945625,854.07324596945625,null,"R4","R-90265","HÁČEK"]
[97,"S101410230","Zavlažovač otočný 3ramenný na podstavci EXP STALCO GARDEN",{"$f":"VLOOKUP(B101,'[1]CENÍK 2023_01'!$C:$L,10,0)","v":"ks"},3,{"$f":"VLOOKUP(B101,'[1]CENÍK 2023_01'!$C:$P,14,0)","v":185.01885243176287},185.01885243176287,555.0565572952886,555.0565572952886,null,"R4.1","R-92625","POLICE"]
[98,"S101410251","Zavlažovač pulzující, kovový EXP STALCO GARDEN",{"$f":"VLOOKUP(B102,'[1]CENÍK 2023_01'!$C:$L,10,0)","v":"ks"},5,{"$f":"VLOOKUP(B102,'[1]CENÍK 2023_01'!$C:$P,14,0)","v":382.67300202384138},382.67300202384138,1913.365010119207,1913.365010119207,null,"R4","R-90265","HÁČEK"]
[99,"S101410281","Zavlažovač vahadlový EXP STALCO GARDEN",{"$f":"VLOOKUP(B103,'[1]CENÍK 2023_01'!$C:$L,10,0)","v":"ks"},4,{"$f":"VLOOKUP(B103,'[1]CENÍK 2023_01'!$C:$P,14,0)","v":498.23974434380227},498.23974434380227,1992.9589773752091,1992.9589773752091,null,"R4","R-90265","HÁČEK"]
[100,"S101410284","Zavlažovač vahadlový nastavitelný EXP STALCO GARDEN",{"$f":"VLOOKUP(B104,'[1]CENÍK 2023_01'!$C:$L,10,0)","v":"ks"},4,{"$f":"VLOOKUP(B104,'[1]CENÍK 2023_01'!$C:$P,14,0)","v":509.6703457659948},509.6703457659948,2038.6813830639792,2038.6813830639792,null,"R4","R-90265","HÁČEK"]
[101,"S101610203","Závěs na hadici EXP STALCO GARDEN",{"$f":"VLOOKUP(B105,'[1]CENÍK 2023_01'!$C:$L,10,0)","v":"ks"},5,{"$f":"VLOOKUP(B105,'[1]CENÍK 2023_01'!$C:$P,14,0)","v":78.909864000000013},78.909864000000013,394.54932000000008,394.54932000000008,null,"R4.1","R-92625","POLICE"]
[102,"S101610215","Vozík na hadice 60m EXP STALCO GARDEN",{"$f":"VLOOKUP(B106,'[1]CENÍK 2023_01'!$C:$L,10,0)","v":"ks"},1,{"$f":"VLOOKUP(B106,'[1]CENÍK 2023_01'!$C:$P,14,0)","v":1375.6812116356148},1375.6812116356148,1375.6812116356148,1375.6812116356148,null,"R4",null,"PODESTA"]
[103,"S101610218","Vozík na hadice kovový 60 m EXP STALCO GARDEN",{"$f":"VLOOKUP(B107,'[1]CENÍK 2023_01'!$C:$L,10,0)","v":"ks"},1,{"$f":"VLOOKUP(B107,'[1]CENÍK 2023_01'!$C:$P,14,0)","v":1727.7429420605961},1727.7429420605961,1727.7429420605961,1727.7429420605961,null,"R4",null,"PODESTA"]
[104,"S101210400","Tryska nastavitelná STR STALCO GARDEN",{"$f":"VLOOKUP(B108,'[1]CENÍK 2023_01'!$C:$L,10,0)","v":"ks"},6,{"$f":"VLOOKUP(B108,'[1]CENÍK 2023_01'!$C:$P,14,0)","v":35.394981148303479},35.394981148303479,212.36988688982086,212.36988688982086,null,"R4.1","R-92625","POLICE"]
[105,"S101210500","Tryska nastavitelná STR HF STALCO GARDEN",{"$f":"VLOOKUP(B109,'[1]CENÍK 2023_01'!$C:$L,10,0)","v":"ks"},20,{"$f":"VLOOKUP(B109,'[1]CENÍK 2023_01'!$C:$P,14,0)","v":45.556640104559392},45.556640104559392,911.13280209118784,911.13280209118784,null,"R4.1","R-92625","POLICE"]
[106,"S101010000","Rychlospojka průchozí 1/2\" XTR STALCO GARDEN",{"$f":"VLOOKUP(B110,'[1]CENÍK 2023_01'!$C:$L,10,0)","v":"ks"},6,{"$f":"VLOOKUP(B110,'[1]CENÍK 2023_01'!$C:$P,14,0)","v":84.406799869389289},84.406799869389289,506.44079921633573,506.44079921633573,null,"R5","R-90265","HÁČEK"]
[107,"S101010003","Rychlospojka s funkcí stop 1/2\" XTR STALCO GARDEN",{"$f":"VLOOKUP(B111,'[1]CENÍK 2023_01'!$C:$L,10,0)","v":"ks"},6,{"$f":"VLOOKUP(B111,'[1]CENÍK 2023_01'!$C:$P,14,0)","v":88.103448038851582},88.103448038851582,528.62068823310949,528.62068823310949,null,"R5","R-90265","HÁČEK"]
[108,"S101010006","Rychlospojka průchozí 3/4\" XTR STALCO GARDEN",{"$f":"VLOOKUP(B112,'[1]CENÍK 2023_01'!$C:$L,10,0)","v":"ks"},6,{"$f":"VLOOKUP(B112,'[1]CENÍK 2023_01'!$C:$P,14,0)","v":102.80202528409455},102.80202528409455,616.81215170456733,616.81215170456733,null,"R5","R-90265","HÁČEK"]
[109,"S101010009","Rychlospojka s funkcí stop 3/4\" XTR STALCO GARDEN",{"$f":"VLOOKUP(B113,'[1]CENÍK 2023_01'!$C:$L,10,0)","v":"ks"},6,{"$f":"VLOOKUP(B113,'[1]CENÍK 2023_01'!$C:$P,14,0)","v":106.41065802095063},106.41065802095063,638.46394812570384,638.46394812570384,null,"R5","R-90265","HÁČEK"]
[110,"S101010012","Rychlospojka s ventilem 1/2\" XTR STALCO GARDEN",{"$f":"VLOOKUP(B114,'[1]CENÍK 2023_01'!$C:$L,10,0)","v":"ks"},6,{"$f":"VLOOKUP(B114,'[1]CENÍK 2023_01'!$C:$P,14,0)","v":101.83385552542588},101.83385552542588,611.00313315255528,611.00313315255528,null,"R5","R-90265","HÁČEK"]
[111,"S101010015","Rychlospojka s ventilem 3/4\" XTR STALCO GARDEN",{"$f":"VLOOKUP(B115,'[1]CENÍK 2023_01'!$C:$L,10,0)","v":"ks"},6,{"$f":"VLOOKUP(B115,'[1]CENÍK 2023_01'!$C:$P,14,0)","v":116.53243277066885},116.53243277066885,699.19459662401312,699.19459662401312,null,"R5","R-90265","HÁČEK"]
[112,"S101010030","Spojka hadicová opravná 1/2\" XTR STALCO GARDEN",{"$f":"VLOOKUP(B116,'[1]CENÍK 2023_01'!$C:$L,10,0)","v":"ks"},6,{"$f":"VLOOKUP(B116,'[1]CENÍK 2023_01'!$C:$P,14,0)","v":123.83771367698721},123.83771367698721,743.02628206192321,743.02628206192321,null,"R5","R-90265","HÁČEK"]
[113,"S101010033","Spojka hadicová opravná 3/4\" XTR STALCO GARDEN",{"$f":"VLOOKUP(B117,'[1]CENÍK 2023_01'!$C:$L,10,0)","v":"ks"},6,{"$f":"VLOOKUP(B117,'[1]CENÍK 2023_01'!$C:$P,14,0)","v":161.42030339985394},161.42030339985394,968.52182039912361,968.52182039912361,null,"R5","R-90265","HÁČEK"]
[114,"S101010036","Spojka hadicová opravná 1/2\" - 3/4\" XTR STALCO GARDEN",{"$f":"VLOOKUP(B118,'[1]CENÍK 2023_01'!$C:$L,10,0)","v":"ks"},6,{"$f":"VLOOKUP(B118,'[1]CENÍK 2023_01'!$C:$P,14,0)","v":143.11309341775492},143.11309341775492,858.67856050652949,858.67856050652949,null,"R5","R-90265","HÁČEK"]
[115,"S101010042","Adaptér dvojitý XTR STALCO GARDEN",{"$f":"VLOOKUP(B119,'[1]CENÍK 2023_01'!$C:$L,10,0)","v":"ks"},6,{"$f":"VLOOKUP(B119,'[1]CENÍK 2023_01'!$C:$P,14,0)","v":42.00939408676679},42.00939408676679,252.05636452060074,252.05636452060074,null,"R5","R-90265","HÁČEK"]
[116,"S101010045","Adaptér trojitý XTR STALCO GARDEN",{"$f":"VLOOKUP(B120,'[1]CENÍK 2023_01'!$C:$L,10,0)","v":"ks"},6,{"$f":"VLOOKUP(B120,'[1]CENÍK 2023_01'!$C:$P,14,0)","v":83.931268602519481},83.931268602519481,503.58761161511688,503.58761161511688,null,"R5","R-90265","HÁČEK"]
[117,"S101010051","Adaptér s vnitřním závitem 3/4\" XTR STALCO GARDEN",{"$f":"VLOOKUP(B121,'[1]CENÍK 2023_01'!$C:$L,10,0)","v":"ks"},6,{"$f":"VLOOKUP(B121,'[1]CENÍK 2023_01'!$C:$P,14,0)","v":38.421091675188784},38.421091675188784,230.52655005113269,230.52655005113269,null,"R5","R-90265","HÁČEK"]
[118,"S101010054","Adaptér s vnitřním závitem 1\" XTR STALCO GARDEN",{"$f":"VLOOKUP(B122,'[1]CENÍK 2023_01'!$C:$L,10,0)","v":"ks"},6,{"$f":"VLOOKUP(B122,'[1]CENÍK 2023_01'!$C:$P,14,0)","v":42.00939408676679},42.00939408676679,252.05636452060074,252.05636452060074,null,"R5","R-90265","HÁČEK"]
[119,"S101010057","Adaptér s vnitřním závitem 1/2\" - 3/4\" XTR STALCO GARDEN",{"$f":"VLOOKUP(B123,'[1]CENÍK 2023_01'!$C:$L,10,0)","v":"ks"},6,{"$f":"VLOOKUP(B123,'[1]CENÍK 2023_01'!$C:$P,14,0)","v":61.176180138854136},61.176180138854136,367.05708083312481,367.05708083312481,null,"R5","R-90265","HÁČEK"]
[120,"S101010060","Adaptér s vnitřním závitem 3/4\" - 1\" XTR STALCO GARDEN",{"$f":"VLOOKUP(B124,'[1]CENÍK 2023_01'!$C:$L,10,0)","v":"ks"},6,{"$f":"VLOOKUP(B124,'[1]CENÍK 2023_01'!$C:$P,14,0)","v":73.954037506912371},73.954037506912371,443.72422504147426,443.72422504147426,null,"R5","R-90265","HÁČEK"]
[121,"S101010066","Adaptér s vnějším závitem 3/4\" XTR STALCO GARDEN",{"$f":"VLOOKUP(B125,'[1]CENÍK 2023_01'!$C:$L,10,0)","v":"ks"},6,{"$f":"VLOOKUP(B125,'[1]CENÍK 2023_01'!$C:$P,14,0)","v":42.972109367921867},42.972109367921867,257.83265620753122,257.83265620753122,null,"R5","R-90265","HÁČEK"]
[122,"S101010072","Rozdělovač dvojitý XTR STALCO GARDEN",{"$f":"VLOOKUP(B126,'[1]CENÍK 2023_01'!$C:$L,10,0)","v":"ks"},4,{"$f":"VLOOKUP(B126,'[1]CENÍK 2023_01'!$C:$P,14,0)","v":319.43436823604685},319.43436823604685,1277.7374729441874,1277.7374729441874,null,"R5","R-90265","HÁČEK"]
[123,"S101010075","Rozdělovač 4ramenný XTR STALCO GARDEN",{"$f":"VLOOKUP(B127,'[1]CENÍK 2023_01'!$C:$L,10,0)","v":"ks"},4,{"$f":"VLOOKUP(B127,'[1]CENÍK 2023_01'!$C:$P,14,0)","v":728.06035277491378},728.06035277491378,2912.2414110996551,2912.2414110996551,null,"R5","R-90265","HÁČEK"]
[124,"S101210000","Tryska rozprašovací nastavitelná XTR STALCO GARDEN",{"$f":"VLOOKUP(B128,'[1]CENÍK 2023_01'!$C:$L,10,0)","v":"ks"},6,{"$f":"VLOOKUP(B128,'[1]CENÍK 2023_01'!$C:$P,14,0)","v":160.05503114947354},160.05503114947354,960.33018689684127,960.33018689684127,null,"R5","R-90265","HÁČEK"]
[125,"S101210030","Pistole zavlažovací nastavitelná XTR STALCO GARDEN",{"$f":"VLOOKUP(B129,'[1]CENÍK 2023_01'!$C:$L,10,0)","v":"ks"},6,{"$f":"VLOOKUP(B129,'[1]CENÍK 2023_01'!$C:$P,14,0)","v":305.06179243977493},305.06179243977493,1830.3707546386495,1830.3707546386495,null,"R5","R-90265","HÁČEK"]
[126,"S101210033","Pistole zavlažovací 8 funkcí XTR STALCO GARDEN",{"$f":"VLOOKUP(B130,'[1]CENÍK 2023_01'!$C:$L,10,0)","v":"ks"},4,{"$f":"VLOOKUP(B130,'[1]CENÍK 2023_01'!$C:$P,14,0)","v":388.05250801952172},388.05250801952172,1552.2100320780869,1552.2100320780869,null,"R5","R-90265","HÁČEK"]
[127,"S101210039","Pistole zavlažovací 6 funkcí XTR STALCO GARDEN",{"$f":"VLOOKUP(B131,'[1]CENÍK 2023_01'!$C:$L,10,0)","v":"ks"},3,{"$f":"VLOOKUP(B131,'[1]CENÍK 2023_01'!$C:$P,14,0)","v":429.95961687897488},429.95961687897488,1289.8788506369247,1289.8788506369247,null,"R5","R-90265","HÁČEK"]
[128,"S101210039","Pistole zavlažovací 6 funkcí XTR STALCO GARDEN",{"$f":"VLOOKUP(B132,'[1]CENÍK 2023_01'!$C:$L,10,0)","v":"ks"},1,{"$f":"VLOOKUP(B132,'[1]CENÍK 2023_01'!$C:$P,14,0)","v":429.95961687897488},429.95961687897488,429.95961687897488,429.95961687897488,null,"R5","R-90440","HÁČEK"]
[129,"S101410042","Zavlažovač turbínový 6 funkcí XTR STALCO GARDEN",{"$f":"VLOOKUP(B133,'[1]CENÍK 2023_01'!$C:$L,10,0)","v":"ks"},3,{"$f":"VLOOKUP(B133,'[1]CENÍK 2023_01'!$C:$P,14,0)","v":726.70890177008539},726.70890177008539,2180.1267053102561,2180.1267053102561,null,"R5","R-90265","HÁČEK"]
[130,"S101410081","Zavlažovač vahadlový nastavitelný XTR STALCO GARDEN",{"$f":"VLOOKUP(B134,'[1]CENÍK 2023_01'!$C:$L,10,0)","v":"ks"},3,{"$f":"VLOOKUP(B134,'[1]CENÍK 2023_01'!$C:$P,14,0)","v":832.27804857599983},832.27804857599983,2496.8341457279994,2496.8341457279994,null,"R5.1","R-92625","POLICE"]
[131,"S101410084","Zavlažovač vahadlový nastavitelný s kovovou základnou XTR STALCO GARDEN",{"$f":"VLOOKUP(B135,'[1]CENÍK 2023_01'!$C:$L,10,0)","v":"ks"},3,{"$f":"VLOOKUP(B135,'[1]CENÍK 2023_01'!$C:$P,14,0)","v":1117.0694267073948},1117.0694267073948,3351.2082801221841,3351.2082801221841,null,"R5.1","R-92625","POLICE"]
[132,"S101610230","Naviják na hadici automatický 25 m EXP STALCO GARDEN",{"$f":"VLOOKUP(B136,'[1]CENÍK 2023_01'!$C:$L,10,0)","v":"ks"},1,{"$f":"VLOOKUP(B136,'[1]CENÍK 2023_01'!$C:$P,14,0)","v":2623.315450722087},2623.315450722087,2623.315450722087,2623.315450722087,null,"R5","R-92677","SYSTÉMOVÁ HRAZDA"]
[133,"S101610233","Naviják na hadici automatický 35 m EXP STALCO GARDEN",{"$f":"VLOOKUP(B137,'[1]CENÍK 2023_01'!$C:$L,10,0)","v":"ks"},1,{"$f":"VLOOKUP(B137,'[1]CENÍK 2023_01'!$C:$P,14,0)","v":3546.04336163383},3546.04336163383,3546.04336163383,3546.04336163383,null,"R5","R-92677","SYSTÉMOVÁ HRAZDA"]
[134,"S101010600","Rychlospojka průchozí 1/2\" BRS STALCO GARDEN",{"$f":"VLOOKUP(B138,'[1]CENÍK 2023_01'!$C:$L,10,0)","v":"ks"},6,{"$f":"VLOOKUP(B138,'[1]CENÍK 2023_01'!$C:$P,14,0)","v":105.63912114325859},105.63912114325859,633.83472685955155,633.83472685955155,null,"R6","R-90265","HÁČEK"]
[135,"S101010603","Rychlospojka s funkcí stop 1/2\" BRS STALCO GARDEN",{"$f":"VLOOKUP(B139,'[1]CENÍK 2023_01'!$C:$L,10,0)","v":"ks"},6,{"$f":"VLOOKUP(B139,'[1]CENÍK 2023_01'!$C:$P,14,0)","v":105.09104530066222},{"$f":"F139-(F139*$I$3)","v":105.09104530066222},630.54627180397324,630.54627180397324,null,"R6","R-90265","HÁČEK "]
[136,"S101010606","Rychlospojka průchozí 3/4\" BRS STALCO GARDEN",{"$f":"VLOOKUP(B140,'[1]CENÍK 2023_01'!$C:$L,10,0)","v":"ks"},6,{"$f":"VLOOKUP(B140,'[1]CENÍK 2023_01'!$C:$P,14,0)","v":136.52995711667666},136.52995711667666,{"$f":"F140*E140","v":819.17974270005993},{"$f":"H140-(H140*$I$3)","v":819.17974270005993},null,"R6","R-90265","HÁČEK"]
[137,"S101010609","Rychlospojka s funkcí stop 3/4\" BRS STALCO GARDEN",{"$f":"VLOOKUP(B141,'[1]CENÍK 2023_01'!$C:$L,10,0)","v":"ks"},6,{"$f":"VLOOKUP(B141,'[1]CENÍK 2023_01'!$C:$P,14,0)","v":127.69354147588004},127.69354147588004,766.16124885528029,766.16124885528029,null,"R6","R-90265","HÁČEK "]
[138,"S101010630","Spojka hadicová opravná 1/2\" BRS STALCO GARDEN",{"$f":"VLOOKUP(B142,'[1]CENÍK 2023_01'!$C:$L,10,0)","v":"ks"},6,{"$f":"VLOOKUP(B142,'[1]CENÍK 2023_01'!$C:$P,14,0)","v":103.36325945962338},103.36325945962338,620.17955675774033,620.17955675774033,null,"R6","R-90265","HÁČEK"]
[139,"S101010633","Spojka hadicová opravná 3/4\" BRS STALCO GARDEN",{"$f":"VLOOKUP(B143,'[1]CENÍK 2023_01'!$C:$L,10,0)","v":"ks"},6,{"$f":"VLOOKUP(B143,'[1]CENÍK 2023_01'!$C:$P,14,0)","v":176.29230487598483},176.29230487598483,1057.7538292559088,1057.7538292559088,null,"R6","R-90265","HÁČEK "]
[140,"S101010642","Konektor dvojitý BRS STALCO GARDEN",{"$f":"VLOOKUP(B144,'[1]CENÍK 2023_01'!$C:$L,10,0)","v":"ks"},6,{"$f":"VLOOKUP(B144,'[1]CENÍK 2023_01'!$C:$P,14,0)","v":55.780355150498679},55.780355150498679,334.68213090299207,334.68213090299207,null,"R6","R-90265","HÁČEK"]
[141,"S101010645","Konektor trojitý BRS STALCO GARDEN",{"$f":"VLOOKUP(B145,'[1]CENÍK 2023_01'!$C:$L,10,0)","v":"ks"},6,{"$f":"VLOOKUP(B145,'[1]CENÍK 2023_01'!$C:$P,14,0)","v":124.18666906817107},124.18666906817107,745.12001440902645,745.12001440902645,null,"R6","R-90265","HÁČEK "]
[142,"S101010651","Adaptér s vnitřním závitem 3/4\" BRS STALCO GARDEN",{"$f":"VLOOKUP(B146,'[1]CENÍK 2023_01'!$C:$L,10,0)","v":"ks"},6,{"$f":"VLOOKUP(B146,'[1]CENÍK 2023_01'!$C:$P,14,0)","v":48.054022173571497},48.054022173571497,288.32413304142898,288.32413304142898,null,"R6","R-90265","HÁČEK"]
[143,"S101010654","Adaptér s vnitřním závitem 1\" BRS STALCO GARDEN",{"$f":"VLOOKUP(B147,'[1]CENÍK 2023_01'!$C:$L,10,0)","v":"ks"},6,{"$f":"VLOOKUP(B147,'[1]CENÍK 2023_01'!$C:$P,14,0)","v":55.577412070429304},55.577412070429304,333.4644724225758,333.4644724225758,null,"R6","R-90265","HÁČEK "]
[144,"S101010657","Adaptér s vnitřním závitem 1/2\" - 3/4\" BRS STALCO GARDEN",{"$f":"VLOOKUP(B148,'[1]CENÍK 2023_01'!$C:$L,10,0)","v":"ks"},6,{"$f":"VLOOKUP(B148,'[1]CENÍK 2023_01'!$C:$P,14,0)","v":80.104532890243163},80.104532890243163,480.62719734145901,480.62719734145901,null,"R6","R-90265","HÁČEK"]
[145,"S101010660","Adaptér s vnitřním závitem 3/4\" - 1\" BRS STALCO GARDEN",{"$f":"VLOOKUP(B149,'[1]CENÍK 2023_01'!$C:$L,10,0)","v":"ks"},6,{"$f":"VLOOKUP(B149,'[1]CENÍK 2023_01'!$C:$P,14,0)","v":110.71994611213849},110.71994611213849,664.31967667283095,664.31967667283095,null,"R6","R-90265","HÁČEK "]
[146,"S101010666","Adaptér s vnějším závitem 3/4\" BRS STALCO GARDEN",{"$f":"VLOOKUP(B150,'[1]CENÍK 2023_01'!$C:$L,10,0)","v":"ks"},6,{"$f":"VLOOKUP(B150,'[1]CENÍK 2023_01'!$C:$P,14,0)","v":48.054022173571497},48.054022173571497,288.32413304142898,288.32413304142898,null,"R6","R-90265","HÁČEK"]
[147,"S101010672","Rozdělovač dvojitý BRS STALCO GARDEN",{"$f":"VLOOKUP(B151,'[1]CENÍK 2023_01'!$C:$L,10,0)","v":"ks"},4,{"$f":"VLOOKUP(B151,'[1]CENÍK 2023_01'!$C:$P,14,0)","v":264.35766866117666},264.35766866117666,1057.4306746447066,1057.4306746447066,null,"R6","R-90265","HÁČEK X 2"]
[148,"S101210600","Tryska nastavitelná BRS STALCO GARDEN",{"$f":"VLOOKUP(B152,'[1]CENÍK 2023_01'!$C:$L,10,0)","v":"ks"},6,{"$f":"VLOOKUP(B152,'[1]CENÍK 2023_01'!$C:$P,14,0)","v":125.78656824936982},125.78656824936982,754.71940949621899,754.71940949621899,null,"R6","R-90265","HÁČEK"]
[149,"S101210603","Pistole zavlažovací nastavitelná BRS STALCO GARDEN",{"$f":"VLOOKUP(B153,'[1]CENÍK 2023_01'!$C:$L,10,0)","v":"ks"},6,{"$f":"VLOOKUP(B153,'[1]CENÍK 2023_01'!$C:$P,14,0)","v":415.68557980020921},415.68557980020921,2494.113478801255,2494.113478801255,null,"R6","R-90265","HÁČEK "]
[150,"S101210606","Pistole zavlažovací 8 funkcí BRS STALCO GARDEN",{"$f":"VLOOKUP(B154,'[1]CENÍK 2023_01'!$C:$L,10,0)","v":"ks"},4,{"$f":"VLOOKUP(B154,'[1]CENÍK 2023_01'!$C:$P,14,0)","v":413.76407480883688},413.76407480883688,1655.0562992353475,1655.0562992353475,null,"R6","R-90265","HÁČEK"]
[151,"S101010700","Konektor s vnitřním závitem 1/2\" BRS GK STALCO GARDEN",{"$f":"VLOOKUP(B155,'[1]CENÍK 2023_01'!$C:$L,10,0)","v":"ks"},6,{"$f":"VLOOKUP(B155,'[1]CENÍK 2023_01'!$C:$P,14,0)","v":74.625069728369851},74.625069728369851,447.75041837021911,447.75041837021911,null,"R6","R-90265","HÁČEK "]
[152,"S101010703","Konektor s vnitřním závitem 3/4\" BRS GK STALCO GARDEN",{"$f":"VLOOKUP(B156,'[1]CENÍK 2023_01'!$C:$L,10,0)","v":"ks"},6,{"$f":"VLOOKUP(B156,'[1]CENÍK 2023_01'!$C:$P,14,0)","v":74.625069728369851},74.625069728369851,447.75041837021911,447.75041837021911,null,"R6","R-90265","HÁČEK"]
[153,"S101010706","Konektor s vnitřním závitem 1\" BRS GK STALCO GARDEN",{"$f":"VLOOKUP(B157,'[1]CENÍK 2023_01'!$C:$L,10,0)","v":"ks"},6,{"$f":"VLOOKUP(B157,'[1]CENÍK 2023_01'!$C:$P,14,0)","v":76.603764759046314},76.603764759046314,459.62258855427785,459.62258855427785,null,"R6","R-90265","HÁČEK "]
[154,"S101010709","Konektor s vnějším závitem 1/2\" BRS GK STALCO GARDEN",{"$f":"VLOOKUP(B158,'[1]CENÍK 2023_01'!$C:$L,10,0)","v":"ks"},6,{"$f":"VLOOKUP(B158,'[1]CENÍK 2023_01'!$C:$P,14,0)","v":71.704138968799825},71.704138968799825,430.22483381279892,430.22483381279892,null,"R6","R-90265","HÁČEK"]
[155,"S101010712","Konektor s vnějším závitem 3/4\" BRS GK STALCO GARDEN",{"$f":"VLOOKUP(B159,'[1]CENÍK 2023_01'!$C:$L,10,0)","v":"ks"},6,{"$f":"VLOOKUP(B159,'[1]CENÍK 2023_01'!$C:$P,14,0)","v":73.682833999476301},73.682833999476301,442.09700399685778,442.09700399685778,null,"R6","R-90265","HÁČEK "]
[156,"S101010715","Konektor s vnějším závitem 1\" BRS GK STALCO GARDEN",{"$f":"VLOOKUP(B160,'[1]CENÍK 2023_01'!$C:$L,10,0)","v":"ks"},6,{"$f":"VLOOKUP(B160,'[1]CENÍK 2023_01'!$C:$P,14,0)","v":75.661529030152778},75.661529030152778,453.96917418091664,453.96917418091664,null,"R6","R-90265","HÁČEK"]
[157,"S101010718","Spojka s konektorem na hadici 1/2\" BRS GK STALCO GARDEN",{"$f":"VLOOKUP(B161,'[1]CENÍK 2023_01'!$C:$L,10,0)","v":"ks"},6,{"$f":"VLOOKUP(B161,'[1]CENÍK 2023_01'!$C:$P,14,0)","v":77.640224060829226},77.640224060829226,465.84134436497538,465.84134436497538,null,"R6","R-90265","HÁČEK "]
[158,"S101010721","Spojka s konektorem na hadici 3/4\" BRS GK STALCO GARDEN",{"$f":"VLOOKUP(B162,'[1]CENÍK 2023_01'!$C:$L,10,0)","v":"ks"},6,{"$f":"VLOOKUP(B162,'[1]CENÍK 2023_01'!$C:$P,14,0)","v":79.618919091505703},79.618919091505703,477.71351454903424,477.71351454903424,null,"R6","R-90265","HÁČEK"]
[159,"S101010724","Spojka s konektorem na hadici 1\" BRS GK STALCO GARDEN",{"$f":"VLOOKUP(B163,'[1]CENÍK 2023_01'!$C:$L,10,0)","v":"ks"},6,{"$f":"VLOOKUP(B163,'[1]CENÍK 2023_01'!$C:$P,14,0)","v":99.688540116938526},99.688540116938526,598.13124070163121,598.13124070163121,null,"R6","R-90265","HÁČEK "]
[160,"S101010727","Spojka s otočným konektorem na hadici 1/2\" BRS GK STALCO GARDEN",{"$f":"VLOOKUP(B164,'[1]CENÍK 2023_01'!$C:$L,10,0)","v":"ks"},6,{"$f":"VLOOKUP(B164,'[1]CENÍK 2023_01'!$C:$P,14,0)","v":128.52095342108143},128.52095342108143,771.12572052648852,771.12572052648852,null,"R6","R-90265","HÁČEK"]
[161,"S101010730","Spojka s otočným konektorem na hadici 3/4\" BRS GK STALCO GARDEN",{"$f":"VLOOKUP(B165,'[1]CENÍK 2023_01'!$C:$L,10,0)","v":"ks"},6,{"$f":"VLOOKUP(B165,'[1]CENÍK 2023_01'!$C:$P,14,0)","v":133.70324992999602},133.70324992999602,802.21949957997617,802.21949957997617,null,"R6","R-90265","HÁČEK "]
[162,"S101010733","Spojka s otočným konektorem na hadici 1\" BRS GK STALCO GARDEN",{"$f":"VLOOKUP(B166,'[1]CENÍK 2023_01'!$C:$L,10,0)","v":"ks"},6,{"$f":"VLOOKUP(B166,'[1]CENÍK 2023_01'!$C:$P,14,0)","v":139.92200574069349},139.92200574069349,839.5320344441609,839.5320344441609,null,"R6","R-90265","HÁČEK"]
[163,"S101010736","Spojka 3ramenná BRS GK STALCO GARDEN S101010736",{"$f":"VLOOKUP(B167,'[1]CENÍK 2023_01'!$C:$L,10,0)","v":"ks"},3,{"$f":"VLOOKUP(B167,'[1]CENÍK 2023_01'!$C:$P,14,0)","v":385.56286026324415},385.56286026324415,1156.6885807897324,1156.6885807897324,null,"R6","R-90265","HÁČEK "]
[164,"S101010739","Spojka s konektorem pro rychlospojku BRS GK STALCO GARDEN",{"$f":"VLOOKUP(B168,'[1]CENÍK 2023_01'!$C:$L,10,0)","v":"ks"},6,{"$f":"VLOOKUP(B168,'[1]CENÍK 2023_01'!$C:$P,14,0)","v":79.147801227058935},79.147801227058935,474.88680736235358,474.88680736235358,null,"R6","R-90265","HÁČEK"]
[165,"S101010742","Konektor uzavírací BRS GK STALCO GARDEN",{"$f":"VLOOKUP(B169,'[1]CENÍK 2023_01'!$C:$L,10,0)","v":"ks"},6,{"$f":"VLOOKUP(B169,'[1]CENÍK 2023_01'!$C:$P,14,0)","v":88.758605661773245},88.758605661773245,532.5516339706395,532.5516339706395,null,"R6","R-90265","HÁČEK "]
[166,"S101610006","Závěs kovový na hadici XTR STALCO GARDEN",{"$f":"VLOOKUP(B170,'[1]CENÍK 2023_01'!$C:$L,10,0)","v":"ks"},5,{"$f":"VLOOKUP(B170,'[1]CENÍK 2023_01'!$C:$P,14,0)","v":166.27007770185614},166.27007770185614,831.35038850928072,831.35038850928072,null,"R6","R-90261","HÁČEK X 2"]
[167,"S101610012","Naviják kovový na hadici 60 m XTR STALCO GARDEN",{"$f":"VLOOKUP(B171,'[1]CENÍK 2023_01'!$C:$L,10,0)","v":"ks"},1,{"$f":"VLOOKUP(B171,'[1]CENÍK 2023_01'!$C:$P,14,0)","v":2657.5488006187761},2657.5488006187761,2657.5488006187761,2657.5488006187761,null,"R6",null,"PODESTA"]
[168,"S101610015","Vozík na hadice kovový 60 m XTR STALCO GARDEN",{"$f":"VLOOKUP(B172,'[1]CENÍK 2023_01'!$C:$L,10,0)","v":"ks"},1,{"$f":"VLOOKUP(B172,'[1]CENÍK 2023_01'!$C:$P,14,0)","v":3127.8103657282704},3127.8103657282704,3127.8103657282704,3127.8103657282704,null,"R6",null,"PODESTA"]
[169,"S103210406","Postřikovač tlakový ruční 1,5l STR STALCO GARDEN",{"$f":"VLOOKUP(B173,'[1]CENÍK 2023_01'!$C:$L,10,0)","v":"ks"},4,{"$f":"VLOOKUP(B173,'[1]CENÍK 2023_01'!$C:$P,14,0)","v":106.02780283103651},106.02780283103651,424.11121132414604,424.11121132414604,null,"R7.1","R-92625","POLICE"]
[170,"S103210409","Postřikovač tlakový ruční 2l STR STALCO GARDEN",{"$f":"VLOOKUP(B174,'[1]CENÍK 2023_01'!$C:$L,10,0)","v":"ks"},4,{"$f":"VLOOKUP(B174,'[1]CENÍK 2023_01'!$C:$P,14,0)","v":114.57843209160397},114.57843209160397,458.31372836641589,458.31372836641589,null,"R7.1","R-92625","POLICE"]
[171,"S103210415","Postřikovač tlakový 5l STR STALCO GARDEN",{"$f":"VLOOKUP(B175,'[1]CENÍK 2023_01'!$C:$L,10,0)","v":"ks"},4,{"$f":"VLOOKUP(B175,'[1]CENÍK 2023_01'!$C:$P,14,0)","v":392.47388306004643},392.47388306004643,1569.8955322401857,1569.8955322401857,null,"R7.3","R-92625","POLICE"]
[172,"S103210418","Postřikovač tlakový 8l STR STALCO GARDEN",{"$f":"VLOOKUP(B176,'[1]CENÍK 2023_01'!$C:$L,10,0)","v":"ks"},4,{"$f":"VLOOKUP(B176,'[1]CENÍK 2023_01'!$C:$P,14,0)","v":435.22702936288374},435.22702936288374,1740.908117451535,1740.908117451535,null,"R7","R-92625","PODESTA"]
[173,"S103210206","Postřikovač tlakový ruční 1,5l EXP STALCO GARDEN",{"$f":"VLOOKUP(B177,'[1]CENÍK 2023_01'!$C:$L,10,0)","v":"ks"},4,{"$f":"VLOOKUP(B177,'[1]CENÍK 2023_01'!$C:$P,14,0)","v":235.99736759166191},235.99736759166191,943.98947036664765,943.98947036664765,null,"R7.1","R-92625","POLICE"]
[174,"S103210209","Postřikovač tlakový ruční 2l EXP STALCO GARDEN",{"$f":"VLOOKUP(B178,'[1]CENÍK 2023_01'!$C:$L,10,0)","v":"ks"},4,{"$f":"VLOOKUP(B178,'[1]CENÍK 2023_01'!$C:$P,14,0)","v":253.09862611279686},253.09862611279686,1012.3945044511875,1012.3945044511875,null,"R7.1","R-92625","POLICE"]
[175,"S103210215","Postřikovač tlakový 5l EXP STALCO GARDEN",{"$f":"VLOOKUP(B179,'[1]CENÍK 2023_01'!$C:$L,10,0)","v":"ks"},4,{"$f":"VLOOKUP(B179,'[1]CENÍK 2023_01'!$C:$P,14,0)","v":714.83260618343968},714.83260618343968,2859.3304247337587,2859.3304247337587,null,"R7.3","R-92625","POLICE"]
[176,"S103210218","Postřikovač tlakový 8l EXP STALCO GARDEN",{"$f":"VLOOKUP(B180,'[1]CENÍK 2023_01'!$C:$L,10,0)","v":"ks"},4,{"$f":"VLOOKUP(B180,'[1]CENÍK 2023_01'!$C:$P,14,0)","v":774.68701100741225},774.68701100741225,3098.748044029649,3098.748044029649,null,"R7","R-92625","PODESTA"]
[177,"S103410203","Sada těsnění NBR pro postřikovače EXP STALCO GARDEN",{"$f":"VLOOKUP(B181,'[1]CENÍK 2023_01'!$C:$L,10,0)","v":"ks"},3,{"$f":"VLOOKUP(B181,'[1]CENÍK 2023_01'!$C:$P,14,0)","v":63.349009826117182},63.349009826117182,190.04702947835153,190.04702947835153,null,"R7","R-90261","HÁČEK"]
[178,"S103410212","Trubice teleskopická s tryskou pro postřikovače EXP STALCO GARDEN",{"$f":"VLOOKUP(B182,'[1]CENÍK 2023_01'!$C:$L,10,0)","v":"ks"},3,{"$f":"VLOOKUP(B182,'[1]CENÍK 2023_01'!$C:$P,14,0)","v":122.68294156466358},122.68294156466358,368.04882469399075,368.04882469399075,null,"R7.2","R-92625","POLICE"]
[179,"S103410221","Ventil s rukojetí a hadicí 150 cm pro postřikovače EXP STALCO GARDEN",{"$f":"VLOOKUP(B183,'[1]CENÍK 2023_01'!$C:$L,10,0)","v":"ks"},2,{"$f":"VLOOKUP(B183,'[1]CENÍK 2023_01'!$C:$P,14,0)","v":158.93017429967784},158.93017429967784,317.86034859935569,317.86034859935569,null,"R7.2","R-92625","POLICE"]
[180,"S103410230","Pumpa pro postřikovače EXP STALCO GARDEN",{"$f":"VLOOKUP(B184,'[1]CENÍK 2023_01'!$C:$L,10,0)","v":"ks"},1,{"$f":"VLOOKUP(B184,'[1]CENÍK 2023_01'!$C:$P,14,0)","v":173.98671712806836},173.98671712806836,173.98671712806836,173.98671712806836,null,"R7.2","R-92625","POLICE"]
[181,"S103410403","Sada těsnění NBR pro postřikovače STR STALCO GARDEN",{"$f":"VLOOKUP(B185,'[1]CENÍK 2023_01'!$C:$L,10,0)","v":"ks"},3,{"$f":"VLOOKUP(B185,'[1]CENÍK 2023_01'!$C:$P,14,0)","v":63.349009826117182},63.349009826117182,190.04702947835153,190.04702947835153,null,"R7","R-90261","HÁČEK"]
[182,"S103410412","Trubice teleskopická s tryskou pro postřikovače STR STALCO GARDEN",{"$f":"VLOOKUP(B186,'[1]CENÍK 2023_01'!$C:$L,10,0)","v":"ks"},3,{"$f":"VLOOKUP(B186,'[1]CENÍK 2023_01'!$C:$P,14,0)","v":122.68294156466358},122.68294156466358,368.04882469399075,368.04882469399075,null,"R7.2","R-92625","POLICE"]
[183,"S103410421","Ventril s rukojetí a hadicí 150 cm pro postřikovače STR STALCO GARDEN",{"$f":"VLOOKUP(B187,'[1]CENÍK 2023_01'!$C:$L,10,0)","v":"ks"},2,{"$f":"VLOOKUP(B187,'[1]CENÍK 2023_01'!$C:$P,14,0)","v":144.98893094005697},144.98893094005697,289.97786188011395,289.97786188011395,null,"R7.2","R-92625","POLICE"]
[184,"S103410503","Kryt proti herbicidům - univerzální STALCO GARDEN",{"$f":"VLOOKUP(B188,'[1]CENÍK 2023_01'!$C:$L,10,0)","v":"ks"},5,{"$f":"VLOOKUP(B188,'[1]CENÍK 2023_01'!$C:$P,14,0)","v":83.647460157725178},83.647460157725178,418.23730078862587,418.23730078862587,null,"R7.2","R-92625","POLICE"]
[185,"S104010406","Nůžky zahradnické STR STALCO GARDEN",{"$f":"VLOOKUP(B189,'[1]CENÍK 2023_01'!$C:$L,10,0)","v":"ks"},10,{"$f":"VLOOKUP(B189,'[1]CENÍK 2023_01'!$C:$P,14,0)","v":235.59661943999996},235.59661943999996,2355.9661943999995,2355.9661943999995,null,"R8","R-90265","HÁČEK"]
[186,"S104010412","Nůžky zahradnické STR STALCO GARDEN",{"$f":"VLOOKUP(B190,'[1]CENÍK 2023_01'!$C:$L,10,0)","v":"ks"},12,{"$f":"VLOOKUP(B190,'[1]CENÍK 2023_01'!$C:$P,14,0)","v":235.59661943999996},235.59661943999996,2827.1594332799996,2827.1594332799996,null,"R8","R-90265","HÁČEK"]
[187,"S104010415","Nůžky zahradnické kovadlinové STR STALCO GARDEN",{"$f":"VLOOKUP(B191,'[1]CENÍK 2023_01'!$C:$L,10,0)","v":"ks"},12,{"$f":"VLOOKUP(B191,'[1]CENÍK 2023_01'!$C:$P,14,0)","v":240.12732365999997},240.12732365999997,2881.5278839199996,2881.5278839199996,null,"R8","R-90265","HÁČEK"]
[188,"S104010421","Nůžky zahradnické STR STALCO GARDEN",{"$f":"VLOOKUP(B192,'[1]CENÍK 2023_01'!$C:$L,10,0)","v":"ks"},10,{"$f":"VLOOKUP(B192,'[1]CENÍK 2023_01'!$C:$P,14,0)","v":253.71943631999994},253.71943631999994,2537.1943631999993,2537.1943631999993,null,"R8","R-90265","HÁČEK"]
[189,"S104010424","Nůžky zahradnické kovadlinové STR STALCO GARDEN",{"$f":"VLOOKUP(B193,'[1]CENÍK 2023_01'!$C:$L,10,0)","v":"ks"},10,{"$f":"VLOOKUP(B193,'[1]CENÍK 2023_01'!$C:$P,14,0)","v":258.25014053999996},258.25014053999996,2582.5014053999994,2582.5014053999994,null,"R8","R-90265","HÁČEK"]
[190,"S104020406","Nůžky na větve 790mm STR STALCO GARDEN",{"$f":"VLOOKUP(B194,'[1]CENÍK 2023_01'!$C:$L,10,0)","v":"ks"},4,{"$f":"VLOOKUP(B194,'[1]CENÍK 2023_01'!$C:$P,14,0)","v":362.45633759999993},362.45633759999993,1449.8253503999997,1449.8253503999997,null,"R8","R-90265","HÁČEK"]
[191,"S104020409","Nůžky na větve teleskopické 650-990mm STR STALCO GARDEN",{"$f":"VLOOKUP(B195,'[1]CENÍK 2023_01'!$C:$L,10,0)","v":"ks"},4,{"$f":"VLOOKUP(B195,'[1]CENÍK 2023_01'!$C:$P,14,0)","v":489.31605575999993},489.31605575999993,1957.2642230399997,1957.2642230399997,null,"R8","R-90265","HÁČEK"]
[192,"S104020412","Nůžky na větve STR 730mm STALCO GARDEN",{"$f":"VLOOKUP(B196,'[1]CENÍK 2023_01'!$C:$L,10,0)","v":"ks"},4,{"$f":"VLOOKUP(B196,'[1]CENÍK 2023_01'!$C:$P,14,0)","v":416.82478823999986},416.82478823999986,1667.2991529599994,1667.2991529599994,null,"R8","R-90265","HÁČEK"]
[193,"S104020415","Nůžky na větve teleskopické 630-950mm STR STALCO GARDEN",{"$f":"VLOOKUP(B197,'[1]CENÍK 2023_01'!$C:$L,10,0)","v":"ks"},4,{"$f":"VLOOKUP(B197,'[1]CENÍK 2023_01'!$C:$P,14,0)","v":543.68450639999992},543.68450639999992,2174.7380255999997,2174.7380255999997,null,"R8","R-90265","HÁČEK"]
[194,"S104020421","Nůžky na větve kovadlinové 790mm STR STALCO GARDEN",{"$f":"VLOOKUP(B198,'[1]CENÍK 2023_01'!$C:$L,10,0)","v":"ks"},4,{"$f":"VLOOKUP(B198,'[1]CENÍK 2023_01'!$C:$P,14,0)","v":425.8861966799999},425.8861966799999,1703.5447867199996,1703.5447867199996,null,"R8","R-90265","HÁČEK"]
[195,"S104020424","Nůžky na větve kovadlinové STR teleskopické 650-990mm STALCO GARDEN",{"$f":"VLOOKUP(B199,'[1]CENÍK 2023_01'!$C:$L,10,0)","v":"ks"},4,{"$f":"VLOOKUP(B199,'[1]CENÍK 2023_01'!$C:$P,14,0)","v":552.74591483999984},552.74591483999984,2210.9836593599994,2210.9836593599994,null,"R8","R-90265","HÁČEK"]
[196,"S104040406","Nůžky na živý plot 630mm STR STALCO GARDEN",{"$f":"VLOOKUP(B200,'[1]CENÍK 2023_01'!$C:$L,10,0)","v":"ks"},5,{"$f":"VLOOKUP(B200,'[1]CENÍK 2023_01'!$C:$P,14,0)","v":380.57915448},380.57915448,1902.8957723999999,1902.8957723999999,null,"R8","R-90265","HÁČEK"]
[197,"S104040409","Nůžky na živý plot teleskopické 690-860mm STR STALCO GARDEN",{"$f":"VLOOKUP(B201,'[1]CENÍK 2023_01'!$C:$L,10,0)","v":"ks"},5,{"$f":"VLOOKUP(B201,'[1]CENÍK 2023_01'!$C:$P,14,0)","v":498.37746419999985},498.37746419999985,2491.8873209999992,2491.8873209999992,null,"R8","R-90265","HÁČEK"]
[198,"S104070212","Pilka zahradní skládací 230mm EXP STALCO GARDEN",{"$f":"VLOOKUP(B202,'[1]CENÍK 2023_01'!$C:$L,10,0)","v":"ks"},6,{"$f":"VLOOKUP(B202,'[1]CENÍK 2023_01'!$C:$P,14,0)","v":308.08788695999993},308.08788695999993,1848.5273217599997,1848.5273217599997,null,"R9","R-90265","HÁČEK"]
[199,"S104070221","Pilka zahradní 270mm EXP STALCO GARDEN",{"$f":"VLOOKUP(B203,'[1]CENÍK 2023_01'!$C:$L,10,0)","v":"ks"},6,{"$f":"VLOOKUP(B203,'[1]CENÍK 2023_01'!$C:$P,14,0)","v":308.08788695999993},{"$f":"F203-(F203*$I$3)","v":308.08788695999993},1848.5273217599997,1848.5273217599997,null,"R9","R-90265","HÁČEK"]
[200,"S104070257","Pila oblouková 533mm EXP STALCO GARDEN",{"$f":"VLOOKUP(B204,'[1]CENÍK 2023_01'!$C:$L,10,0)","v":"ks"},5,{"$f":"VLOOKUP(B204,'[1]CENÍK 2023_01'!$C:$P,14,0)","v":208.41239411999993},208.41239411999993,{"$f":"F204*E204","v":1042.0619705999998},{"$f":"H204-(H204*$I$3)","v":1042.0619705999998},null,"R9","R-98020","HÁČEK NA PILY"]
[201,"S104070260","Pila oblouková 610mm EXP STALCO GARDEN",{"$f":"VLOOKUP(B205,'[1]CENÍK 2023_01'!$C:$L,10,0)","v":"ks"},5,{"$f":"VLOOKUP(B205,'[1]CENÍK 2023_01'!$C:$P,14,0)","v":217.47380255999997},217.47380255999997,1087.3690127999998,1087.3690127999998,null,"R9","R-98020","HÁČEK NA PILY"]
[202,"S104097257","Pilový list do obloukové pily 533mm EXP na mokré dřevo STALCO GARDEN",{"$f":"VLOOKUP(B206,'[1]CENÍK 2023_01'!$C:$L,10,0)","v":"ks"},10,{"$f":"VLOOKUP(B206,'[1]CENÍK 2023_01'!$C:$P,14,0)","v":50.743887263999994},50.743887263999994,507.43887263999994,507.43887263999994,null,"R9","R-90261","HÁČEK"]
[203,"S104097258","Pilový list do obloukové pily 533mm EXP na suché dřevoSTALCO GARDEN",{"$f":"VLOOKUP(B207,'[1]CENÍK 2023_01'!$C:$L,10,0)","v":"ks"},10,{"$f":"VLOOKUP(B207,'[1]CENÍK 2023_01'!$C:$P,14,0)","v":57.993014015999989},57.993014015999989,579.93014015999984,579.93014015999984,null,"R9","R-90261","HÁČEK"]
[204,"S104097260","Pilový list do obloukové pily 610mm EXP na mokré dřevo STALCO GARDEN",{"$f":"VLOOKUP(B208,'[1]CENÍK 2023_01'!$C:$L,10,0)","v":"ks"},10,{"$f":"VLOOKUP(B208,'[1]CENÍK 2023_01'!$C:$P,14,0)","v":50.743887263999994},50.743887263999994,507.43887263999994,507.43887263999994,null,"R9","R-90261","HÁČEK"]
[205,"S104097261","Pilový list do obloukové pily 610mm EXP na suché dřevo STALCO GARDEN",{"$f":"VLOOKUP(B209,'[1]CENÍK 2023_01'!$C:$L,10,0)","v":"ks"},10,{"$f":"VLOOKUP(B209,'[1]CENÍK 2023_01'!$C:$P,14,0)","v":57.993014015999989},57.993014015999989,579.93014015999984,579.93014015999984,null,"R9","R-90261","HÁČEK"]
[206,"S104210203","Sekera univerzální 630g EXP STALCO GARDEN",{"$f":"VLOOKUP(B210,'[1]CENÍK 2023_01'!$C:$L,10,0)","v":"ks"},4,{"$f":"VLOOKUP(B210,'[1]CENÍK 2023_01'!$C:$P,14,0)","v":517.68220392000001},517.68220392000001,2070.72881568,2070.72881568,null,"R9","R-90265","HÁČEK"]
[207,"S104210206","Sekera univerzální 950g EXP STALCO GARDEN",{"$f":"VLOOKUP(B211,'[1]CENÍK 2023_01'!$C:$L,10,0)","v":"ks"},4,{"$f":"VLOOKUP(B211,'[1]CENÍK 2023_01'!$C:$P,14,0)","v":635.87448791999986},635.87448791999986,2543.4979516799995,2543.4979516799995,null,"R9","R-90265","HÁČEK"]
[208,"S104210209","Sekera štípací 1240g EXP STALCO GARDEN",{"$f":"VLOOKUP(B212,'[1]CENÍK 2023_01'!$C:$L,10,0)","v":"ks"},3,{"$f":"VLOOKUP(B212,'[1]CENÍK 2023_01'!$C:$P,14,0)","v":769.82574311999997},769.82574311999997,2309.4772293599999,2309.4772293599999,null,"R9","R-90265","HÁČEK"]
[209,"S104210212","Sekera štípací 1710g EXP STALCO GARDEN",{"$f":"VLOOKUP(B213,'[1]CENÍK 2023_01'!$C:$L,10,0)","v":"ks"},3,{"$f":"VLOOKUP(B213,'[1]CENÍK 2023_01'!$C:$P,14,0)","v":958.93339751999986},958.93339751999986,2876.8001925599997,2876.8001925599997,null,"R9","R-90265","HÁČEK"]
[210,"S104210215","Sekera štípací 2300g EXP STALCO GARDEN",{"$f":"VLOOKUP(B214,'[1]CENÍK 2023_01'!$C:$L,10,0)","v":"ks"},2,{"$f":"VLOOKUP(B214,'[1]CENÍK 2023_01'!$C:$P,14,0)","v":1155.9205375199999},1155.9205375199999,2311.8410750399999,2311.8410750399999,null,"R9","R-90265","HÁČEK"]
[211,"S104210251","Brousek na sekery a nože EXP STALCO GARDEN",{"$f":"VLOOKUP(B215,'[1]CENÍK 2023_01'!$C:$L,10,0)","v":"ks"},12,{"$f":"VLOOKUP(B215,'[1]CENÍK 2023_01'!$C:$P,14,0)","v":118.192284},118.192284,1418.3074080000001,1418.3074080000001,null,"R9","R-90265","HÁČEK"]
[212,null,"Nůž univerzální",{"$f":"VLOOKUP(B216,'[1]CENÍK 2023_01'!$C:$L,10,0)","v":{"$error":"#N/A"}},null,null,0,0,0,null,"R9","R-90265","HÁČEK"]
[213,"S105610451","Set drobného zahradnického nářadí STR STALCO GARDEN",{"$f":"VLOOKUP(B217,'[1]CENÍK 2023_01'!$C:$L,10,0)","v":"ks"},4,{"$f":"VLOOKUP(B217,'[1]CENÍK 2023_01'!$C:$P,14,0)","v":416.71773240864769},416.71773240864769,1666.8709296345908,1666.8709296345908,null,"R9",null,"PODESTA"]
[214,"S-76353","Rukavice kožené \"SKIN COMFORT GRIP\"",{"$f":"VLOOKUP(B218,'[1]CENÍK 2023_01'!$C:$L,10,0)","v":"pár"},6,{"$f":"VLOOKUP(B218,'[1]CENÍK 2023_01'!$C:$P,14,0)","v":278.7},278.7,1672.1999999999998,1672.1999999999998,null,"R9","R-90265","HÁČEK"]
[215,"S-76354","Rukavice kožené \"SKIN COMFORT GRIP\"",{"$f":"VLOOKUP(B219,'[1]CENÍK 2023_01'!$C:$L,10,0)","v":"pár"},6,{"$f":"VLOOKUP(B219,'[1]CENÍK 2023_01'!$C:$P,14,0)","v":278.7},278.7,1672.1999999999998,1672.1999999999998,null,"R9","R-90265","HÁČEK"]
[216,"S-76355","Rukavice kožené \"SKIN COMFORT GRIP\"",{"$f":"VLOOKUP(B220,'[1]CENÍK 2023_01'!$C:$L,10,0)","v":"pár"},6,{"$f":"VLOOKUP(B220,'[1]CENÍK 2023_01'!$C:$P,14,0)","v":278.7},278.7,1672.1999999999998,1672.1999999999998,null,"R9","R-90265","HÁČEK"]
[217,"S-76356","Rukavice kožené \"SKIN COMFORT GRIP\"",{"$f":"VLOOKUP(B221,'[1]CENÍK 2023_01'!$C:$L,10,0)","v":"pár"},6,{"$f":"VLOOKUP(B221,'[1]CENÍK 2023_01'!$C:$P,14,0)","v":278.7},278.7,1672.1999999999998,1672.1999999999998,null,"R9","R-90265","HÁČEK"]
[218,"S105610000","Lopatka široká XTR STALCO GARDEN",{"$f":"VLOOKUP(B222,'[1]CENÍK 2023_01'!$C:$L,10,0)","v":"ks"},6,{"$f":"VLOOKUP(B222,'[1]CENÍK 2023_01'!$C:$P,14,0)","v":193.40905917722318},193.40905917722318,1160.4543550633391,1160.4543550633391,null,"R10","R-90265","HÁČEK"]
[219,"S105610003","Lopatka úzká XTR STALCO GARDE",{"$f":"VLOOKUP(B223,'[1]CENÍK 2023_01'!$C:$L,10,0)","v":"ks"},6,{"$f":"VLOOKUP(B223,'[1]CENÍK 2023_01'!$C:$P,14,0)","v":183.40514232322886},183.40514232322886,1100.4308539393733,1100.4308539393733,null,"R10","R-90265","HÁČEK"]
[220,"S105610006","Vidle ruční XTR STALCO GARDEN",{"$f":"VLOOKUP(B224,'[1]CENÍK 2023_01'!$C:$L,10,0)","v":"ks"},6,{"$f":"VLOOKUP(B224,'[1]CENÍK 2023_01'!$C:$P,14,0)","v":229.25642790403612},229.25642790403612,1375.5385674242166,1375.5385674242166,null,"R10","R-90265","HÁČEK"]
[221,"S105610009","Hrábě ruční XTR STALCO GARDEN",{"$f":"VLOOKUP(B225,'[1]CENÍK 2023_01'!$C:$L,10,0)","v":"ks"},6,{"$f":"VLOOKUP(B225,'[1]CENÍK 2023_01'!$C:$P,14,0)","v":267.60477584434756},267.60477584434756,1605.6286550660852,1605.6286550660852,null,"R10","R-90265","HÁČEK"]
[222,"S105610012","Hrábě vějířové ruční XTR STALCO GARDEN",{"$f":"VLOOKUP(B226,'[1]CENÍK 2023_01'!$C:$L,10,0)","v":"ks"},6,{"$f":"VLOOKUP(B226,'[1]CENÍK 2023_01'!$C:$P,14,0)","v":221.75349026354039},221.75349026354039,1330.5209415812424,1330.5209415812424,null,"R10","R-90265","HÁČEK"]
[223,"S105610015","Kultivátor 3 zubyXTR STALCO GARDEN",{"$f":"VLOOKUP(B227,'[1]CENÍK 2023_01'!$C:$L,10,0)","v":"ks"},6,{"$f":"VLOOKUP(B227,'[1]CENÍK 2023_01'!$C:$P,14,0)","v":224.25446947703895},224.25446947703895,1345.5268168622338,1345.5268168622338,null,"R10","R-90265","HÁČEK"]
[224,"S105610018","Motyčka s kultivátorem XTR STALCO GARDEN",{"$f":"VLOOKUP(B228,'[1]CENÍK 2023_01'!$C:$L,10,0)","v":"ks"},6,{"$f":"VLOOKUP(B228,'[1]CENÍK 2023_01'!$C:$P,14,0)","v":319.29167958998477},319.29167958998477,1915.7500775399085,1915.7500775399085,null,"R10","R-90265","HÁČEK"]
[225,"S105610200","Lopatka široká EXP STALCO GARDEN",{"$f":"VLOOKUP(B229,'[1]CENÍK 2023_01'!$C:$L,10,0)","v":"ks"},6,{"$f":"VLOOKUP(B229,'[1]CENÍK 2023_01'!$C:$P,14,0)","v":138.38751648025453},138.38751648025453,830.3250988815272,830.3250988815272,null,"R10","R-90265","HÁČEK"]
[226,"S105610203","Lopatka úzká EXP STALCO GARDEN",{"$f":"VLOOKUP(B230,'[1]CENÍK 2023_01'!$C:$L,10,0)","v":"ks"},6,{"$f":"VLOOKUP(B230,'[1]CENÍK 2023_01'!$C:$P,14,0)","v":129.21725936409308},129.21725936409308,775.30355618455849,775.30355618455849,null,"R10","R-90265","HÁČEK"]
[227,"S105610206","Vidle ruční EXP STALCO GARDEN",{"$f":"VLOOKUP(B231,'[1]CENÍK 2023_01'!$C:$L,10,0)","v":"ks"},6,{"$f":"VLOOKUP(B231,'[1]CENÍK 2023_01'!$C:$P,14,0)","v":166.73194756657171},166.73194756657171,1000.3916853994302,1000.3916853994302,null,"R10","R-90265","HÁČEK"]
[228,"S105610209","Hrábě ruční EXP STALCO GARDEN",{"$f":"VLOOKUP(B232,'[1]CENÍK 2023_01'!$C:$L,10,0)","v":"ks"},6,{"$f":"VLOOKUP(B232,'[1]CENÍK 2023_01'!$C:$P,14,0)","v":171.7339059935689},171.7339059935689,1030.4034359614134,1030.4034359614134,null,"R10","R-90265","HÁČEK"]
[229,"S105610212","Hrábě vějířové ruční EXP STALCO GARDEN",{"$f":"VLOOKUP(B233,'[1]CENÍK 2023_01'!$C:$L,10,0)","v":"ks"},6,{"$f":"VLOOKUP(B233,'[1]CENÍK 2023_01'!$C:$P,14,0)","v":205.91395524471605},205.91395524471605,1235.4837314682964,1235.4837314682964,null,"R10","R-90265","HÁČEK"]
[230,"S105610215","Kultivátor 3 zubyEXP STALCO GARDEN",{"$f":"VLOOKUP(B234,'[1]CENÍK 2023_01'!$C:$L,10,0)","v":"ks"},6,{"$f":"VLOOKUP(B234,'[1]CENÍK 2023_01'!$C:$P,14,0)","v":162.56364887740742},162.56364887740742,975.38189326444444,975.38189326444444,null,"R10","R-90265","HÁČEK"]
[231,"S105610218","Motyčka s kultivátorem EXP STALCO GARDEN",{"$f":"VLOOKUP(B235,'[1]CENÍK 2023_01'!$C:$L,10,0)","v":"ks"},6,{"$f":"VLOOKUP(B235,'[1]CENÍK 2023_01'!$C:$P,14,0)","v":192.57539943939034},192.57539943939034,1155.452396636342,1155.452396636342,null,"R10","R-90265","HÁČEK"]
[232,"S105610400","Lopatka široká plastová STR STALCO GARDEN",{"$f":"VLOOKUP(B236,'[1]CENÍK 2023_01'!$C:$L,10,0)","v":"ks"},10,{"$f":"VLOOKUP(B236,'[1]CENÍK 2023_01'!$C:$P,14,0)","v":42.242442680061103},42.242442680061103,422.42442680061106,422.42442680061106,null,"R10","R-90265","HÁČEK"]
[233,"S105610403","Lopatka úzká plastová STR STALCO GARDEN",{"$f":"VLOOKUP(B237,'[1]CENÍK 2023_01'!$C:$L,10,0)","v":"ks"},10,{"$f":"VLOOKUP(B237,'[1]CENÍK 2023_01'!$C:$P,14,0)","v":34.440874144048877},34.440874144048877,344.40874144048877,344.40874144048877,null,"R10","R-90265","HÁČEK"]
[234,"S105610406","Vidle ruční plastové STR STALCO GARDEN",{"$f":"VLOOKUP(B238,'[1]CENÍK 2023_01'!$C:$L,10,0)","v":"ks"},10,{"$f":"VLOOKUP(B238,'[1]CENÍK 2023_01'!$C:$P,14,0)","v":34.440874144048877},34.440874144048877,344.40874144048877,344.40874144048877,null,"R10","R-90265","HÁČEK"]
[235,"S105610415","Kultivátor 3 zuby plastový STR STALCO GARDEN",{"$f":"VLOOKUP(B239,'[1]CENÍK 2023_01'!$C:$L,10,0)","v":"ks"},10,{"$f":"VLOOKUP(B239,'[1]CENÍK 2023_01'!$C:$P,14,0)","v":55.505109191281875},55.505109191281875,555.05109191281872,555.05109191281872,null,"R10","R-90265","HÁČEK"]
[236,"S105610418","Motyka plastová STR STALCO GARDEN",{"$f":"VLOOKUP(B240,'[1]CENÍK 2023_01'!$C:$L,10,0)","v":"ks"},10,{"$f":"VLOOKUP(B240,'[1]CENÍK 2023_01'!$C:$P,14,0)","v":35.221030997650097},35.221030997650097,352.21030997650098,352.21030997650098,null,"R10","R-90265","HÁČEK"]
[237,"S105610448","Podložka pod kolena STR STALCO GARDEN",{"$f":"VLOOKUP(B241,'[1]CENÍK 2023_01'!$C:$L,10,0)","v":"ks"},10,{"$f":"VLOOKUP(B241,'[1]CENÍK 2023_01'!$C:$P,14,0)","v":69.547932556103873},69.547932556103873,695.47932556103876,695.47932556103876,null,"R10","R-90265","HÁČEK"]
[238,"S106610203","Koš zahradnický skládací 80l EXP",{"$f":"VLOOKUP(B242,'[1]CENÍK 2023_01'!$C:$L,10,0)","v":"ks"},5,{"$f":"VLOOKUP(B242,'[1]CENÍK 2023_01'!$C:$P,14,0)","v":266.56628753323798},266.56628753323798,1332.8314376661899,1332.8314376661899,null,"R10.1","R-90355","KOŠ"]
[239,"S106610206","Koš zahradnický skládací 172l EXP",{"$f":"VLOOKUP(B243,'[1]CENÍK 2023_01'!$C:$L,10,0)","v":"ks"},5,{"$f":"VLOOKUP(B243,'[1]CENÍK 2023_01'!$C:$P,14,0)","v":359.420654146554},359.420654146554,1797.1032707327699,1797.1032707327699,null,"R10.1","R-90355","KOŠ"]
[240,"S106610003","Koš zahradnický skládací vyztužené dno 80l XTR",{"$f":"VLOOKUP(B244,'[1]CENÍK 2023_01'!$C:$L,10,0)","v":"ks"},3,{"$f":"VLOOKUP(B244,'[1]CENÍK 2023_01'!$C:$P,14,0)","v":413.19814336655395},413.19814336655395,1239.5944300996618,1239.5944300996618,null,"R10.1","R-90355","KOŠ"]
[241,"S106610006","Koš zahradnický skládací vyztužené dno 172l XTR",{"$f":"VLOOKUP(B245,'[1]CENÍK 2023_01'!$C:$L,10,0)","v":"ks"},3,{"$f":"VLOOKUP(B245,'[1]CENÍK 2023_01'!$C:$P,14,0)","v":566.84811256655394},566.84811256655394,1700.5443376996618,1700.5443376996618,null,"R10.1","R-90355","KOŠ"]
[242,"S105010600","Rýč rovný TRADITIONAL",{"$f":"VLOOKUP(B246,'[1]CENÍK 2023_01'!$C:$L,10,0)","v":"ks"},5,{"$f":"VLOOKUP(B246,'[1]CENÍK 2023_01'!$C:$P,14,0)","v":402.52799999999996},402.52799999999996,2012.6399999999999,2012.6399999999999,null,"R11","R-91817","SYSTÉMOVÁ HRAZDA"]
[243,"S105010603","Rýč špičatý TRADITIONAL",{"$f":"VLOOKUP(B247,'[1]CENÍK 2023_01'!$C:$L,10,0)","v":"ks"},5,{"$f":"VLOOKUP(B247,'[1]CENÍK 2023_01'!$C:$P,14,0)","v":402.52799999999996},402.52799999999996,2012.6399999999999,2012.6399999999999,null,"R11","R-91817","SYSTÉMOVÁ HRAZDA"]
[244,"S105010609","Lopata TRADITIONAL",{"$f":"VLOOKUP(B248,'[1]CENÍK 2023_01'!$C:$L,10,0)","v":"ks"},5,{"$f":"VLOOKUP(B248,'[1]CENÍK 2023_01'!$C:$P,14,0)","v":372.33839999999998},372.33839999999998,1861.692,1861.692,null,"R11","R-91823","SYSTÉMOVÁ HRAZDA"]
[245,"S105210606","Hrábě TRADITIONAL 12 zubů STALCO GARDEN",{"$f":"VLOOKUP(B249,'[1]CENÍK 2023_01'!$C:$L,10,0)","v":"ks"},5,{"$f":"VLOOKUP(B249,'[1]CENÍK 2023_01'!$C:$P,14,0)","v":327.05399999999997},327.05399999999997,1635.27,1635.27,null,"R11","R-90271","HÁČEK NA HRÁBĚ"]
[246,"S105210612","Hrábě TRADITIONAL 16 zubů STALCO GARDEN",{"$f":"VLOOKUP(B250,'[1]CENÍK 2023_01'!$C:$L,10,0)","v":"ks"},5,{"$f":"VLOOKUP(B250,'[1]CENÍK 2023_01'!$C:$P,14,0)","v":345.74279999999999},345.74279999999999,1728.7139999999999,1728.7139999999999,null,"R11","R-90271","HÁČEK NA HRÁBĚ"]
[247,"S105210651","Motyka TRADITIONAL 18cm",{"$f":"VLOOKUP(B251,'[1]CENÍK 2023_01'!$C:$L,10,0)","v":"ks"},5,{"$f":"VLOOKUP(B251,'[1]CENÍK 2023_01'!$C:$P,14,0)","v":291.83279999999996},291.83279999999996,1459.1639999999998,1459.1639999999998,null,"R11","R-90261","HÁČEK"]
[248,"S105210660","Kultivátor 3 hroty TRADITIONAL ",{"$f":"VLOOKUP(B252,'[1]CENÍK 2023_01'!$C:$L,10,0)","v":"ks"},5,{"$f":"VLOOKUP(B252,'[1]CENÍK 2023_01'!$C:$P,14,0)","v":291.83279999999996},291.83279999999996,1459.1639999999998,1459.1639999999998,null,"R11","R-90261","HÁČEK"]
[249,"S105210312","Hrábě univer zubůální 12 zubů EXP STALCO GARDEN",{"$f":"VLOOKUP(B253,'[1]CENÍK 2023_01'!$C:$L,10,0)","v":"ks"},4,{"$f":"VLOOKUP(B253,'[1]CENÍK 2023_01'!$C:$P,14,0)","v":464.6897913450187},464.6897913450187,1858.7591653800748,1858.7591653800748,null,"R12","R-90261","HÁČEK"]
[250,"S105210315","Hrábě univer zubůální 18 zubů EXP STALCO GARDEN",{"$f":"VLOOKUP(B254,'[1]CENÍK 2023_01'!$C:$L,10,0)","v":"ks"},4,{"$f":"VLOOKUP(B254,'[1]CENÍK 2023_01'!$C:$P,14,0)","v":511.16260462377022},511.16260462377022,2044.6504184950809,2044.6504184950809,null,"R12","R-90261","HÁČEK"]
[251,"S105210330","Hrábě na listí 50 cm EXP STALCO GARDEN",{"$f":"VLOOKUP(B255,'[1]CENÍK 2023_01'!$C:$L,10,0)","v":"ks"},5,{"$f":"VLOOKUP(B255,'[1]CENÍK 2023_01'!$C:$P,14,0)","v":456.9487956335181},456.9487956335181,2284.7439781675903,2284.7439781675903,null,"R12","R-90271","HÁČEK"]
[252,"S105210500","Hrábě nastavitelné STR",{"$f":"VLOOKUP(B256,'[1]CENÍK 2023_01'!$C:$L,10,0)","v":"ks"},12,{"$f":"VLOOKUP(B256,'[1]CENÍK 2023_01'!$C:$P,14,0)","v":229.61726754939829},229.61726754939829,2755.4072105927794,2755.4072105927794,null,"R12","R-90261","HÁČEK X 2"]
[253,"S105210506","Hrábě nastavitelné hliníkové, teleskopické STR",{"$f":"VLOOKUP(B257,'[1]CENÍK 2023_01'!$C:$L,10,0)","v":"ks"},12,{"$f":"VLOOKUP(B257,'[1]CENÍK 2023_01'!$C:$P,14,0)","v":336.39402159500332},336.39402159500332,4036.7282591400399,4036.7282591400399,null,"R12","R-90261","HÁČEK X 2"]
[254,"S105210372","Vytrhávač plevele EXP",{"$f":"VLOOKUP(B258,'[1]CENÍK 2023_01'!$C:$L,10,0)","v":"ks"},5,{"$f":"VLOOKUP(B258,'[1]CENÍK 2023_01'!$C:$P,14,0)","v":877.58230506659993},877.58230506659993,4387.9115253330001,4387.9115253330001,null,"R12","R-90265","HÁČEK"]
[255,"S105210333","Hrábě na listí 60 cm EXP STALCO GARDEN",{"$f":"VLOOKUP(B259,'[1]CENÍK 2023_01'!$C:$L,10,0)","v":"ks"},5,{"$f":"VLOOKUP(B259,'[1]CENÍK 2023_01'!$C:$P,14,0)","v":484.35357820001917},484.35357820001917,2421.7678910000959,2421.7678910000959,null,"R13","R-90271","HÁČEK NA HRÁBĚ"]
[256,"S105210351","Koště 40cm EXP",{"$f":"VLOOKUP(B260,'[1]CENÍK 2023_01'!$C:$L,10,0)","v":"ks"},4,{"$f":"VLOOKUP(B260,'[1]CENÍK 2023_01'!$C:$P,14,0)","v":474.33536698954293},474.33536698954293,1897.3414679581717,1897.3414679581717,null,"R13","R-90261","HÁČEK"]
[257,"S105210354","Koště 65cm EXP",{"$f":"VLOOKUP(B261,'[1]CENÍK 2023_01'!$C:$L,10,0)","v":"ks"},4,{"$f":"VLOOKUP(B261,'[1]CENÍK 2023_01'!$C:$P,14,0)","v":563.27324830008229},563.27324830008229,2253.0929932003291,2253.0929932003291,null,"R13","R-90261","HÁČEK"]
[258,"S105010200","Rýč rovný EXP",{"$f":"VLOOKUP(B262,'[1]CENÍK 2023_01'!$C:$L,10,0)","v":"ks"},5,{"$f":"VLOOKUP(B262,'[1]CENÍK 2023_01'!$C:$P,14,0)","v":422.65439999999995},422.65439999999995,2113.2719999999999,2113.2719999999999,null,"R13","R-91817","SYSTÉMOVÁ HRAZDA"]
[259,"S105010203","Rýč špičatý EXP",{"$f":"VLOOKUP(B263,'[1]CENÍK 2023_01'!$C:$L,10,0)","v":"ks"},5,{"$f":"VLOOKUP(B263,'[1]CENÍK 2023_01'!$C:$P,14,0)","v":422.65439999999995},422.65439999999995,2113.2719999999999,2113.2719999999999,null,"R13","R-91817","SYSTÉMOVÁ HRAZDA"]
[260,"S105010209","Lopata EXP",{"$f":"VLOOKUP(B264,'[1]CENÍK 2023_01'!$C:$L,10,0)","v":"ks"},5,{"$f":"VLOOKUP(B264,'[1]CENÍK 2023_01'!$C:$P,14,0)","v":422.65439999999995},422.65439999999995,2113.2719999999999,2113.2719999999999,null,"R13","R-91817","SYSTÉMOVÁ HRAZDA"]
[261,"S-74001","Lopata na písek, kovová násada, PVC rukojeť",{"$f":"VLOOKUP(B265,'[1]CENÍK 2023_01'!$C:$L,10,0)","v":"ks"},4,{"$f":"VLOOKUP(B265,'[1]CENÍK 2023_01'!$C:$P,14,0)","v":751.3},751.3,3005.2,3005.2,null,"R14","R-91817","SYSTÉMOVÁ HRAZDA"]
[262,"S-74003","Rýč rovný, kovová násada, PVC rukojeť",{"$f":"VLOOKUP(B266,'[1]CENÍK 2023_01'!$C:$L,10,0)","v":"ks"},8,{"$f":"VLOOKUP(B266,'[1]CENÍK 2023_01'!$C:$P,14,0)","v":726.5},726.5,5812,5812,null,"R14","R-91817","SYSTÉMOVÁ HRAZDA"]
[263,"S-74005","Rýč špičatý, kovová násada, PVC rukojeť",{"$f":"VLOOKUP(B267,'[1]CENÍK 2023_01'!$C:$L,10,0)","v":"ks"},4,{"$f":"VLOOKUP(B267,'[1]CENÍK 2023_01'!$C:$P,14,0)","v":726.5},{"$f":"F267-(F267*$I$3)","v":726.5},2906,2906,null,"R14","R-91817","SYSTÉMOVÁ HRAZDA"]
[264,"S-74007","Vidle rycí, kovová násada, PVC rukojeť",{"$f":"VLOOKUP(B268,'[1]CENÍK 2023_01'!$C:$L,10,0)","v":"ks"},4,{"$f":"VLOOKUP(B268,'[1]CENÍK 2023_01'!$C:$P,14,0)","v":886.5},886.5,{"$f":"F268*E268","v":3546},{"$f":"H268-(H268*$I$3)","v":3546},null,"R14","R-91817","SYSTÉMOVÁ HRAZDA"]
[265,"S-74009","Hrábě ERGO 16 zubů, kovová/*pogumovaná násada",{"$f":"VLOOKUP(B269,'[1]CENÍK 2023_01'!$C:$L,10,0)","v":"ks"},4,{"$f":"VLOOKUP(B269,'[1]CENÍK 2023_01'!$C:$P,14,0)","v":644.70000000000005},644.70000000000005,2578.8000000000002,2578.8000000000002,null,"R14","R-91817","SYSTÉMOVÁ HRAZDA"]
[266,"S-76317","Rukavice nylonové \"NITRILE FLEX PVC DOTS\"",{"$f":"VLOOKUP(B270,'[1]CENÍK 2023_01'!$C:$L,10,0)","v":"pár"},12,{"$f":"VLOOKUP(B270,'[1]CENÍK 2023_01'!$C:$P,14,0)","v":111.6},111.6,1339.1999999999998,1339.1999999999998,null,"R14","R-90265","HÁČEK"]
[267,"S-76319","Rukavice nylonové \"NITRILE FLEX PVC DOTS\"",{"$f":"VLOOKUP(B271,'[1]CENÍK 2023_01'!$C:$L,10,0)","v":"pár"},12,{"$f":"VLOOKUP(B271,'[1]CENÍK 2023_01'!$C:$P,14,0)","v":111.6},111.6,1339.1999999999998,1339.1999999999998,null,"R14","R-90265","HÁČEK"]
[268,"S-76321","Rukavice nylonové \"NITRILE FLEX PVC DOTS\"",{"$f":"VLOOKUP(B272,'[1]CENÍK 2023_01'!$C:$L,10,0)","v":"pár"},12,{"$f":"VLOOKUP(B272,'[1]CENÍK 2023_01'!$C:$P,14,0)","v":111.6},111.6,1339.1999999999998,1339.1999999999998,null,"R14","R-90265","HÁČEK"]
[269,"S-76322","Rukavice nylonové \"NITRILE FLEX PVC DOTS\"",{"$f":"VLOOKUP(B273,'[1]CENÍK 2023_01'!$C:$L,10,0)","v":"pár"},12,{"$f":"VLOOKUP(B273,'[1]CENÍK 2023_01'!$C:$P,14,0)","v":111.6},111.6,1339.1999999999998,1339.1999999999998,null,"R14","R-90265","HÁČEK"]
[null,null,"SUMA",null,{"$f":"SUM(E5:E273)","v":2050},null,null,{"$f":"SUM(H5:H273)","v":349156.62446777185},{"$f":"SUM(I5:I273)","v":349156.62446777185}]
[]
[]
[]
[]
[]
[]
[]
[]
[]
[]
[]
[null,null,"Specifikace regálových prvků",null,null,null,null,"rabat",0]
["Poz.","Kat. číslo","Popis","MJ","Množství","cena","Cena po odečtení rabatu","Celkem","Celkem po odečtení rabatu"]
[1,"R-90261","JEDNODUCHÝ HÁČEK S CENOVKOU","ks",19,69.867360000000005,{"$f":"F288-(F288*$I$286)","v":69.867360000000005},{"$f":"F288*E288","v":1327.4798400000002},{"$f":"H288-(H288*$I$286)","v":1327.4798400000002}]
[2,"R-90265","DVOJITÝ HÁČEK S CENOVKOU","ks",150,78.780479999999997,{"$f":"F289-(F289*$I$286)","v":78.780479999999997},{"$f":"F289*E289","v":11817.072},{"$f":"H289-(H289*$I$286)","v":11817.072}]
[3,"R-90277","SYSTÉMOVÁ HRAZDA","ks",6,422.79816,422.79816,2536.7889599999999,2536.7889599999999]
[4,"R-90271","HÁK NA HRÁBĚ","ks",4,94.665959999999998,94.665959999999998,378.66383999999999,378.66383999999999]
[5,"R-91817","DRŽÁK NA HRAZDU S 5 PŮLKULATÝMI VÝŘEZY","ks",11,208.73952,208.73952,2296.13472,2296.13472]
[6,"R-91823","DRŽÁK NA HRAZDU S 5 HRANATÝMI VÝŘEZY","ks",1,229.6566,229.6566,229.6566,229.6566]
[7,"R-90440","HÁK NA ELEKTRONÁŘADÍ","ks",2,27.81756,27.81756,55.635120000000001,55.635120000000001]
[8,"R-90355","KOŠ NA BHP","ks",1,1952.76396,1952.76396,1952.76396,1952.76396]
[9,"R-90358","ROZDĚLOVNÍK DO KOŠE NA BHP","ks",3,223.11551999999998,223.11551999999998,669.34655999999995,669.34655999999995]
[10,"R-90305","CENOVÁ LIŠTA STŘÍBNRÁ 950mm BU","ks",29,26.30808,26.30808,762.93431999999996,762.93431999999996]
[11,"R-90315","CENOVÁ LIŠTA TRANSPARENTNÍ 65MM BU","ks",184,2.7314400000000001,2.7314400000000001,502.58496000000002,502.58496000000002]
[12,"R-98020","HÁK PRO OBLOUKOVÉ PILY 100X50X76MM NA PERFOROVANÝ PLECH R-98020","bal.",3,70.442400000000006,70.442400000000006,{"$f":"F299*E299","v":211.3272},{"$f":"H299-(H299*$I$286)","v":211.3272}]
[13,"R-92625","POLICE PLECHOVÁ 40CM 1M R-92625","ks",15,1320.6045179999999,1320.6045179999999,19809.067769999998,19809.067769999998]
[14,"R-92627","OHRANIČENÍ POLICE 1000MM R-92627","ks",11,583.23432000000003,583.23432000000003,6415.5775200000007,6415.5775200000007]
[15,"R-92630","POLICOVÁ PŘÍČKA S OMEZOVAČI 40CM R-92630","ks",8,219.23399999999998,219.23399999999998,1753.8719999999998,1753.8719999999998]
[16,"R-92662","GRAFIKA MAGNETICKÁ (150MM X 100MM) R-92662","ks",2,0,0,0,0]
[17,"R-92658","GRAFIKA MAGNETICKÁ VIP (180MM X 295MM) R-92658","ks",1,0,0,0,0]
[18,"R-92677","DRŽÁK NOSNÍKU PRO AUTOMATICKÉ NAVÍJEČE R-92677","ks",2,179.55624,179.55624,359.11248000000001,359.11248000000001]
[19,"R-91084","GRAFIKA LOGO STALCO DO CENOVÉ LIŠTY (POZADÍ POD CENOVKY) R-91084 BU","ks",29,27.170639999999999,27.170639999999999,787.94855999999993,787.94855999999993]
[20,"R-91832","TYČ FI 5 934 x 81MM PRO NOSNÍKY ZA CENOVOU LIŠTU R-91832","ks",8,65.410799999999995,65.410799999999995,523.28639999999996,523.28639999999996]
[21,"R-90293","CENOVKA PRO SYSTÉMOVOU HRAZDU","ks",4,25.876799999999999,25.876799999999999,103.5072,103.5072]
[23,"SZKIELET",null,"bal.",null,0,0,0,{"$f":"H309-(H309*$I$286)","v":0}]
[null,null,"SUMA",null,{"$f":"SUM(E288:E309)","v":493},null,null,{"$f":"SUM(H288:H309)","v":52492.760009999998},{"$f":"SUM(I288:I309)","v":52492.760009999998}]

{"sheet":"Regál 1","index":1,"n_rows":40,"n_cols":13,"rows_kept":40,"cut":false,"hidden":false,"merged":[[0,0,0,12]]}
["Regál 1"]
[]
[null,null,"Specifikace",null,null,null,null,"rabat",0,null,"Prvky regálu a umístění produktu"]
["Poz.","Kat. číslo","Popis","jm","Množství","Kat. cena bez DPH","Cena po odečtení rabatu","Celkem","Celkem po odečtení rabatu","Obrázek","Místo na regálu","Kat. číslo","Cílová pozice"]
[1,"S102081215","Hadice zahradní 1/2\" 15m STR STALCO GARDEN","ks",3,226.37024640000001,{"$f":"F5-(F5*$I$3)","v":226.37024640000001},{"$f":"F5*E5","v":679.11073920000001},{"$f":"H5-(H5*$I$3)","v":679.11073920000001},null,"R1.1","R-92625","POLICE"]
[2,"S102081220","Hadice zahradní 1/2\" 20m STR STALCO GARDEN","ks",3,301.82699520000006,{"$f":"F6-(F6*$I$3)","v":301.82699520000006},{"$f":"F6*E6","v":905.48098560000017},{"$f":"H6-(H6*$I$3)","v":905.48098560000017},null,"R1.1","R-92625","POLICE"]
[3,"S102081230","Hadice zahradní 1/2\" 30m STR STALCO GARDEN","ks",3,452.74049280000003,452.74049280000003,{"$f":"F7*E7","v":1358.2214784},1358.2214784,null,"R1.1","R-92625","POLICE"]
[4,"S102081250","Hadice zahradní 1/2\" 50m STR STALCO GARDEN","ks",2,754.56748800000003,754.56748800000003,1509.1349760000001,1509.1349760000001,null,"R1.2","R-92625","POLICE"]
[5,"S102083420","Hadice zahradní 3/4\" 20m STR STALCO GARDEN","ks",3,558.93888000000004,558.93888000000004,1676.81664,1676.81664,null,"R1.3","R-92625","POLICE"]
[6,"S102083430","Hadice zahradní 3/4\" 30m STR STALCO GARDEN","ks",3,838.40832000000012,838.40832000000012,2515.2249600000005,2515.2249600000005,null,"R1.3","R-92625","POLICE"]
[7,"S102083450","Hadice zahradní 3/4\" 50m STR STALCO GARDEN","ks",2,1397.3471999999999,1397.3471999999999,2794.6943999999999,2794.6943999999999,null,"R1",null,"POLICE"]
[8,"S102081010","Hadice zahradní 1\" 10m STR STALCO GARDEN","ks",1,449.01423360000001,449.01423360000001,449.01423360000001,449.01423360000001,null,"R1",null,"POLICE"]
[9,"S102081020","Hadice zahradní 1\" 20m STR STALCO GARDEN","ks",1,898.02846720000002,898.02846720000002,898.02846720000002,898.02846720000002,null,"R1",null,"POLICE"]
[10,"S102061220","Hadice zahradní 1/2\" 20m EXP STALCO GARDEN","ks",3,454.60362239999995,454.60362239999995,1363.8108671999998,1363.8108671999998,null,"R1.2","R-92625","POLICE"]
[11,"S102061230","Hadice zahradní 1/2\" 30m EXP STALCO GARDEN","ks",3,681.90543360000004,681.90543360000004,2045.7163008000002,2045.7163008000002,null,"R1.2","R-92625","POLICE"]
[12,"S102061250","Hadice zahradní 1/2\" 50m EXP STALCO GARDEN","ks",3,1136.5090560000001,1136.5090560000001,3409.5271680000005,3409.5271680000005,null,"R1.3","R-92625","POLICE"]
[13,"S102063420","Hadice zahradní 3/4\" 20m EXP STALCO GARDEN","ks",3,674.45291520000001,674.45291520000001,2023.3587456,2023.3587456,null,"R1.3","R-92625","POLICE"]
[14,"S102063430","Hadice zahradní 3/4\" 30m EXP STALCO GARDEN","ks",3,1011.6793727999999,1011.6793727999999,3035.0381183999998,3035.0381183999998,null,"R1",null,"PODESTA"]
[15,"S102063450","Hadice zahradní 3/4\" 50m EXP STALCO GARDEN","ks",2,1686.1322879999998,1686.1322879999998,3372.2645759999996,3372.2645759999996,null,"R1",null,"PODESTA"]
[null,null,"SUMA",null,38,null,null,{"$f":"SUM(H5:H19)","v":28035.442655999999},{"$f":"SUM(I5:I19)","v":28035.442655999999}]
[]
[]
[]
[]
[]
[]
[]
[]
[]
[]
[]
[null,null,"Specifikace regálových prvků",null,null,null,null,"rabat",0]
["Poz.","Kat. číslo","Popis","MJ","Množství","cena","Cena po odečtení rabatu","Celkem","Celkem po odečtení rabatu"]
[1,"R-90305","CENOVÁ LIŠTA STŘÍBRNÁ 950mm BU","ks",4,26.30808,{"$f":"F34-(F34*$I$32)","v":26.30808},{"$f":"F34*E34","v":105.23232},{"$f":"H34-(H34*$I$32)","v":105.23232}]
[2,"R-92625","POLICE PLECHOVÁ 40CM 1M R-92625","ks",3,1320.6045179999999,{"$f":"F35-(F35*$I$32)","v":1320.6045179999999},3961.8135539999994,{"$f":"H35-(H35*$I$32)","v":3961.8135539999994}]
[3,"R-92627","ZARÁŽKA POLICE 1000MM R-92627","ks",4,583.23432000000003,583.23432000000003,2332.9372800000001,2332.9372800000001]
[4,"R-92630","ROZDĚLOVAČ POLICE S E ZARÁŽKOU 40CM R-92630","ks",4,219.23399999999998,219.23399999999998,876.93599999999992,876.93599999999992]
[5,"R-91084","GRAFIKA LOGO STALCO DOC ENOVÉ LIŠTY (POZADÍ POD CENOVKY) R-91084 BU","ks",4,27.170639999999999,27.170639999999999,108.68256,108.68256]
[6,"SZKIELET",null,"bal.",null,0,{"$f":"F39-(F39*$I$32)","v":0},0,{"$f":"H39-(H39*$I$32)","v":0}]
[null,null,"SUMA",null,19,null,null,{"$f":"SUM(H34:H39)","v":7385.6017139999994},{"$f":"SUM(I34:I39)","v":7385.6017139999994}]

{"sheet":"Regál 2","index":2,"n_rows":37,"n_cols":13,"rows_kept":37,"cut":false,"hidden":false,"merged":[[0,0,0,12],[2,10,2,12]]}
["Regál 2"]
[]
[null,null,"Specifikace",null,null,null,null,"rabat",0,null,"Prvky regálu a umístění produktu"]
["Poz.","Kat. číslo","Popis","MJ","Množství","Kat. cena bez DPH","Cena po odečtení rabatu","Celkem","Celkem po odečtení rabatu","Obrázek","Místo na regálu","Kat. číslo","Cílová pozice"]
[1,"S102041220","Hadice zahradní ATS 1/2\" 20m EXP STALCO GARDEN","ks",3,566.39139839999996,{"$f":"F5-(F5*$I$3)","v":566.39139839999996},{"$f":"F5*E5","v":1699.1741951999998},{"$f":"H5-(H5*$I$3)","v":1699.1741951999998},null,"R2.1","R-92625","PÓŁKA"]
[2,"S102041230","Hadice zahradní ATS 1/2\" 30m EXP STALCO GARDEN","ks",3,849.58709759999999,{"$f":"F6-(F6*$I$3)","v":849.58709759999999},{"$f":"F6*E6","v":2548.7612927999999},{"$f":"H6-(H6*$I$3)","v":2548.7612927999999},null,"R2.1","R-92625","PÓŁKA"]
[3,"S102041250","Hadice zahradní ATS 1/2\" 50m EXP STALCO GARDEN","ks",3,1415.9784960000002,1415.9784960000002,4247.935488000001,4247.935488000001,null,"R.1.3","R-92625","PÓŁKA"]
[4,"S102043420","Hadice zahradní ATS 3/4\" 20m EXP STALCO GARDEN","ks",3,894.30220799999995,894.30220799999995,2682.9066239999997,2682.9066239999997,null,"R2.1","R-92625","PÓŁKA"]
[5,"S102043430","Hadice zahradní ATS 3/4\" 30m EXP STALCO GARDEN","ks",2,1341.4533119999999,1341.4533119999999,2682.9066239999997,2682.9066239999997,null,"R2",null,"PODEST"]
[6,"S102043450","Hadice zahradní ATS 3/4\" 50m EXP STALCO GARDEN","ks",2,2235.7555200000002,2235.7555200000002,4471.5110400000003,4471.5110400000003,null,"R2",null,"PODEST"]
[7,"S102021220","Hadice zahradní ATS 1/2\" 20m XTR STALCO GARDEN","ks",3,715.44176640000001,715.44176640000001,2146.3252991999998,2146.3252991999998,null,"R2.2","R-92625","PÓŁKA"]
[8,"S102021230","Hadice zahradní ATS 1/2\" 30m XTR STALCO GARDEN","ks",3,1073.1626495999999,1073.1626495999999,3219.4879487999997,3219.4879487999997,null,"R2.2","R-92625","PÓŁKA"]
[9,"S102021250","Hadice zahradní ATS 1/2\" 50m XTR STALCO GARDEN","ks",3,1788.6044159999999,1788.6044159999999,5365.8132479999995,5365.8132479999995,null,"R2.3","R-92625","PÓŁKA"]
[10,"S102023420","Hadice zahradní ATS 3/4\" 20m XTR STALCO GARDEN","ks",3,1136.5090560000001,1136.5090560000001,3409.5271680000005,3409.5271680000005,null,"R2.2","R-92625","PÓŁKA"]
[11,"S102023430","Hadice zahradní ATS 3/4\" 30m XTR STALCO GARDEN","ks",3,1704.763584,1704.763584,5114.2907519999999,5114.2907519999999,null,"R2",null,"PODEST"]
[12,"S102023450","Hadice zahradní ATS 3/4\" 50m XTR STALCO GARDEN","ks",2,2841.2726400000001,2841.2726400000001,5682.5452800000003,5682.5452800000003,null,"R2",null,"PODEST"]
[null,null,"SUMA",null,{"$f":"SUM(E5:E16)","v":33},null,null,{"$f":"SUM(H5:H16)","v":43271.184959999999},{"$f":"SUM(I5:I16)","v":43271.184959999999}]
[]
[]
[]
[]
[]
[]
[]
[]
[]
[]
[]
[null,null,"Specifikace regálových prvků",null,null,null,null,"rabat",0]
["Poz.","Kat. číslo","Popis","MJ","Množství","cena","Cena po odečtení rabatu","Celkem","Celkem po odečtení rabatu"]
[1,"R-90305","CENOVÁ LIŠTA STŘÍBNRÁ 950mm BU","ks",4,26.30808,{"$f":"F31-(F31*$I$29)","v":26.30808},{"$f":"F31*E31","v":105.23232},{"$f":"H31-(H31*$I$29)","v":105.23232}]
[2,"R-92625","POLICE PLECHOVÁ 40CM 1M R-92625","ks",3,1320.6045179999999,{"$f":"F32-(F32*$I$29)","v":1320.6045179999999},3961.8135539999994,{"$f":"H32-(H32*$I$29)","v":3961.8135539999994}]
[3,"R-92627","OHRANIČENÍ POLICE 1000MM R-92627","ks",4,583.23432000000003,583.23432000000003,2332.9372800000001,2332.9372800000001]
[4,"R-92630","POLICOVÁ PŘÍČKA S OMEZOVAČI 40CM R-92630","ks",4,219.23399999999998,219.23399999999998,876.93599999999992,876.93599999999992]
[5,"R-91084","GRAFIKA LOGO STALCO DO CENOVÉ LIŠTY (POZADÍ POD CENOVKY) R-91084 BU","ks",4,27.170639999999999,27.170639999999999,108.68256,108.68256]
[6,"SZKIELET",null,"bal.",null,0,{"$f":"F36-(F36*$I$29)","v":0},0,{"$f":"H36-(H36*$I$29)","v":0}]
[null,null,"SUMA",null,{"$f":"SUM(E31:E36)","v":19},null,null,{"$f":"SUM(H31:H36)","v":7385.6017139999994},{"$f":"SUM(I31:I36)","v":7385.6017139999994}]

{"sheet":"Regál 3","index":3,"n_rows":67,"n_cols":13,"rows_kept":67,"cut":false,"hidden":false,"merged":[[0,0,0,12]]}
["Regál 3"]
[]
[null,null,"Specifikace",null,null,null,null,"rabat",0,null,"Prvky regálu a umístění produktu"]
["Poz.","Kat. číslo","Popis","MJ","Množství","Kat. cena bez DPH","Cena po odečtení rabatu","Celkem","Celkem po odečtení rabatu","Obrázek","Místo na regálu","Kat. číslo","Cílová pozice"]
[1,"S101010400","Rychlospojka průchozí 1/2\" STR STALCO GARDEN","ks",30,18.358993698847666,{"$f":"F5-(F5*$I$3)","v":18.358993698847666},{"$f":"F5*E5","v":550.76981096543},{"$f":"H5-(H5*$I$3)","v":550.76981096543},null,"R3.1","R-92625","POLICE"]
[2,"S101010403","Rychlospojka s funkcí stop 1/2\" STR STALCO GARDEN","ks",30,20.710089773867136,{"$f":"F6-(F6*$I$3)","v":20.710089773867136},{"$f":"F6*E6","v":621.30269321601406},{"$f":"H6-(H6*$I$3)","v":621.30269321601406},null,"R3.1","R-92625","POLICE"]
[3,"S101010406","Rychlospojka průchozí 3/4\" STR STALCO GARDEN","ks",30,22.754521143449278,22.754521143449278,682.63563430347835,682.63563430347835,null,"R3.1","R-92625","POLICE"]
[4,"S101010409","Rychlospojka s funkcí stop 3/4\" STR STALCO GARDEN","ks",30,24.79895251303142,24.79895251303142,743.96857539094265,743.96857539094265,null,"R3.1","R-92625","POLICE"]
[5,"S101010430","Spojka hadicová opravná 1/2\" STR STALCO GARDEN","ks",30,14.576795665120695,14.576795665120695,437.30386995362085,437.30386995362085,null,"R3.1","R-92625","POLICE"]
[6,"S101010433","Spojka hadicová opravná 3/4\" STR STALCO GARDEN","ks",30,18.665658404284986,18.665658404284986,559.96975212854954,559.96975212854954,null,"R3.1","R-92625","POLICE"]
[7,"S101010436","Spojka hadicová opravná 1/2\" - 3/4\" STR STALCO GARDEN","ks",30,18.665658404284986,18.665658404284986,559.96975212854954,559.96975212854954,null,"R3.1","R-92625","POLICE"]
[8,"S101010442","Konektor dvojitý STR STALCO GARDEN","ks",30,11.007072463018156,11.007072463018156,330.2121738905447,330.2121738905447,null,"R3.2","R-92625","POLICE"]
[9,"S101010445","Konektor trojitý STR STALCO GARDEN","ks",30,14.372352528162482,14.372352528162482,431.17057584487446,431.17057584487446,null,"R3.2","R-92625","POLICE"]
[10,"S101010448","Adaptér s vnitřním závitem 1/2\" STR STALCO GARDEN","ks",30,14.246766029745292,14.246766029745292,427.40298089235876,427.40298089235876,null,"R3.2","R-92625","POLICE"]
[11,"S101010451","Adaptér s vnitřním závitem 3/4\" STR STALCO GARDEN","ks",30,15.999135775101418,15.999135775101418,479.97407325304255,479.97407325304255,null,"R3.2","R-92625","POLICE"]
[12,"S101010454","Adaptér s vnitřním závitem 1\" STR STALCO GARDEN","ks",30,19.065782829474635,19.065782829474635,571.97348488423904,571.97348488423904,null,"R3.2","R-92625","POLICE"]
[13,"S101010457","Adaptér s vnitřním závitem 1/2\" - 3/4\" STR STALCO GARDEN","ks",30,19.503875265813665,19.503875265813665,585.1162579744099,585.1162579744099,null,"R3.2","R-92625","POLICE"]
[14,"S101010460","Adaptér s vnitřním závitem 3/4\" - 1\" STR STALCO GARDEN","ks",30,23.008614756525919,23.008614756525919,690.2584426957776,690.2584426957776,null,"R3.2","R-92625","POLICE"]
[15,"S101010463","Adaptér s vnějším závitem 1/2\" STR STALCO GARDEN","ks",30,9.1590525357280104,9.1590525357280104,274.77157607184029,274.77157607184029,null,"R3.2","R-92625","POLICE"]
[16,"S101010466","Adaptér s vnějším závitem 3/4\" STR STALCO GARDEN","ks",30,9.1590525357280104,9.1590525357280104,274.77157607184029,274.77157607184029,null,"R3.3","R-92625","POLICE"]
[17,"S101010472","Rozdělovač dvojitý s ventily STR STALCO GARDEN","ks",6,147.60188048067343,147.60188048067343,885.61128288404052,885.61128288404052,null,"R3","R-90265","HÁČEK"]
[18,"S101210412","Zavlažovací tryska, sada 4 ks 1/2\" STR STALCO GARDEN","ks",6,68.681491273983255,68.681491273983255,412.08894764389953,412.08894764389953,null,"R3","R-90265","HÁČEK"]
[19,"S101210415","Zavlažovací tryska, sada 4 ks 3/4\" STR STALCO GARDEN","ks",6,78.442931193537433,78.442931193537433,470.65758716122457,470.65758716122457,null,"R3","R-90265","HÁČEK"]
[20,"S101210430","Pistole zavlažovací nastavitelná STR STALCO GARDEN","ks",6,106.84412369608653,106.84412369608653,641.06474217651919,641.06474217651919,null,"R3","R-90265","HÁČEK"]
[21,"S101210433","Pistole zavlažovací 8 funkcí STR STALCO GARDEN","ks",4,129.8177218346917,129.8177218346917,519.27088733876678,519.27088733876678,null,"R3","R-90265","HÁČEK"]
[22,"S101410400","Zavlažovač na trnu STR STALCO GARDEN","ks",6,50.25402279671026,50.25402279671026,301.52413678026153,301.52413678026153,null,"R3","R-90265","HÁČEK"]
[23,"S101410412","Zavlažovač 8 funkcí na trnu STR STALCO GARDEN","ks",4,92.011332681717761,92.011332681717761,368.04533072687104,368.04533072687104,null,"R3","R-90265","HÁČEK"]
[24,"S101410415","Zavlažovač 8 funkcí na podstavci STR STALCO GARDEN","ks",4,18.688800000000001,18.688800000000001,74.755200000000002,74.755200000000002,null,"R3","R-90265","HÁČEK"]
[25,"S101410430","Zavlažovač otočný, 3ramnný na trnu STR STALCO GARDEN","ks",6,58.82243695523352,58.82243695523352,352.93462173140114,352.93462173140114,null,"R3","R-90265","HÁČEK"]
[26,"S101410451","Zavlažovač pulzující na trnu STR STALCO GARDEN S101410451","ks",5,80.297604778252747,80.297604778252747,401.48802389126377,401.48802389126377,null,"R3","R-90265","HÁČEK"]
[27,"S101410481","Zavlažovač vahadlový STR STALCO GARDEN","ks",3,323.16663579654511,323.16663579654511,969.49990738963538,969.49990738963538,null,"R3","R-90265","HÁČEK"]
[28,"S101010500","Rychlospojka průchozí 3/4\" STR HF STALCO GARDEN","ks",30,24.925999319569744,24.925999319569744,747.77997958709227,747.77997958709227,null,"R3.3","R-92625","POLICE"]
[29,"S101010503","Rychlospojka s funkcí stop 3/4\" STR HF STALCO GARDEN","ks",30,28.722800434508009,28.722800434508009,861.68401303524024,861.68401303524024,null,"R3.3","R-92625","POLICE"]
[30,"S101010506","Rychlospojka průchozí 1\" STR HF STALCO GARDEN","ks",20,56.249608517810479,56.249608517810479,1124.9921703562095,1124.9921703562095,null,"R3.3","R-92625","POLICE"]
[31,"S101010509","Rychlospojka s funkcí stop 1\" STR HF STALCO GARDEN","ks",20,58.14800907527961,58.14800907527961,1162.9601815055921,1162.9601815055921,null,"R3.3","R-92625","POLICE"]
[32,"S101010533","Spojka hadicová opravná 1\" STR HF STALCO GARDEN","ks",20,49.605206566668492,49.605206566668492,992.10413133336988,992.10413133336988,null,"R3.3","R-92625","POLICE"]
[33,"S101010536","Spojka hadicová opravná 3/4\" - 1\" STR HF STALCO GARDEN","ks",20,42.96080461552652,42.96080461552652,859.21609231053037,859.21609231053037,null,"R3.4","R-92625","POLICE"]
[34,"S101010542","Konektor dvojitý STR HF STALCO GARDEN","ks",30,23.027598762100606,23.027598762100606,690.82796286301823,690.82796286301823,null,"R3.4","R-92625","POLICE"]
[35,"S101010545","Konektor dvojitý s redukcí STR HF STALCO GARDEN","ks",30,21.413958288251841,21.413958288251841,642.41874864755528,642.41874864755528,null,"R3.4","R-92625","POLICE"]
[36,"S101010548","Konektor trojitý STR HF STALCO GARDEN","ks",20,32.519601549446286,32.519601549446286,650.39203098892574,650.39203098892574,null,"R3.4","R-92625","POLICE"]
[37,"S101010551","Konektor 3ramenný s redukcí STR HF STALCO GARDEN ","ks",20,26.159959681924683,26.159959681924683,523.19919363849363,523.19919363849363,null,"R3.4","R-92625","POLICE"]
[38,"S101010554","Adaptér s vnitřním závitem 1\" STR HF STALCO GARDEN","ks",20,23.027598762100606,23.027598762100606,460.55197524201213,460.55197524201213,null,"R3.4","R-92625","POLICE"]
[39,"S101010560","Adaptér s vnitřním závitem 3/4\" - 1\" STR HF STALCO GARDEN","ks",20,30.621200991977151,30.621200991977151,612.42401983954301,612.42401983954301,null,"R3.4","R-92625","POLICE"]
[40,"S101010566","Adaptér s vnějším závitem 3/4\" STR HF STALCO GARDEN","ks",30,14.484796253489501,14.484796253489501,434.54388760468504,434.54388760468504,null,"R3.4","R-92625","POLICE"]
[41,"S101610212","Naviják na hadici 45 m EXP STALCO GARDEN","ks",4,650.43404696015307,650.43404696015307,2601.7361878406123,2601.7361878406123,null,"R3",null,"PODESTA"]
[null,null,"SUMA",null,850,null,null,{"$f":"SUM(H5:H45)","v":25983.342472182278},{"$f":"SUM(I5:I45)","v":25983.342472182278}]
[]
[]
[]
[]
[]
[]
[]
[]
[]
[]
[]
[null,null,"Specifikace regálových prvků",null,null,null,null,"rabat",0]
["Poz.","Kat. číslo","Popis","MJ","Množství","cena","Cena po odečtení rabatu","Celkem","Celkem po odečtení rabatu"]
[1,"R-90265","DVOJITÝ HÁČEK S CENOVKOU","ks",12,78.780479999999997,{"$f":"F60-(F60*$I$58)","v":78.780479999999997},{"$f":"F60*E60","v":945.36575999999991},{"$f":"H60-(H60*$I$58)","v":945.36575999999991}]
[2,"R-90305","CENOVÁ LIŠTA STŘÍBNRÁ 950mm BU","ks",5,26.30808,{"$f":"F61-(F61*$I$58)","v":26.30808},131.54040000000001,{"$f":"H61-(H61*$I$58)","v":131.54040000000001}]
[3,"R-90315","CENOVÁ LIŠTA TRANSPARENTNÍ 65MM BU","ks",12,2.7314400000000001,2.7314400000000001,32.777280000000005,32.777280000000005]
[4,"R-92625","POLICE PLECHOVÁ 40CM 1M R-92625","ks",4,1320.6045179999999,1320.6045179999999,5282.4180719999995,5282.4180719999995]
[5,"R-91084","GRAFIKA LOGO STALCO DO CENOVÉ LIŠTY (POZADÍ POD CENOVKY) R-91084 BU","ks",5,27.170639999999999,27.170639999999999,135.85319999999999,135.85319999999999]
[6,"R-91832","TYČ FI 5 934 x 81MM PRO NOSNÍKY ZA CENOVOU LIŠTU R-91832","ks",4,65.410799999999995,65.410799999999995,261.64319999999998,261.64319999999998]
[7,"SZKIELET",null,"bal.",null,0,{"$f":"F66-(F66*$I$58)","v":0},0,{"$f":"H66-(H66*$I$58)","v":0}]
[null,null,"SUMA",null,42,null,null,{"$f":"SUM(H60:H66)","v":6789.5979119999993},{"$f":"SUM(I60:I66)","v":6789.5979119999993}]

{"sheet":"Regál 4","index":4,"n_rows":63,"n_cols":13,"rows_kept":63,"cut":false,"hidden":false,"merged":[[0,0,0,12]]}
["Regál 4"]
[]
[null,null,"Specifikace",null,null,null,null,"rabat",0,null,"Prvky regálu a umístění produktu"]
["Poz.","Kat. číslo","Popis","MJ","Množství","Kat. cena bez DPH","Cena po odečtení rabatu","Celkem","Celkem po odečtení rabatu","Obrázek","Místo na regálu","Kat. číslo","Cílová pozice"]
[1,"S101010200","Rychlospojka průchozí 1/2\" EXP STALCO GARDEN","ks",6,46.721525475148567,{"$f":"F5-(F5*$I$3)","v":46.721525475148567},{"$f":"F5*E5","v":280.32915285089143},{"$f":"H5-(H5*$I$3)","v":280.32915285089143},null,"R4","R-90265","HÁČEK"]
[2,"S101010203","Rychlospojka s funkcí stop 1/2\" EXP STALCO GARDEN","ks",6,50.535527554752541,{"$f":"F6-(F6*$I$3)","v":50.535527554752541},{"$f":"F6*E6","v":303.21316532851523},{"$f":"H6-(H6*$I$3)","v":303.21316532851523},null,"R4","R-90265","HÁČEK"]
[3,"S101010206","Rychlospojka průchozí 3/4\" EXP STALCO GARDEN","ks",6,49.582027034851556,49.582027034851556,297.49216220910932,297.49216220910932,null,"R4","R-90265","HÁČEK"]
[4,"S101010209","Rychlospojka s funkcí stop 3/4\" EXP STALCO GARDEN","ks",6,53.396029114455516,53.396029114455516,320.37617468673307,320.37617468673307,null,"R4","R-90265","HÁČEK"]
[5,"S101010212","Rychlospojka s ventilem 1/2\" EXP STALCO GARDEN","ks",6,67.698536912970383,67.698536912970383,406.1912214778223,406.1912214778223,null,"R4","R-90265","HÁČEK"]
[6,"S101010215","Rychlospojka s ventilem 3/4\" EXP STALCO GARDEN","ks",6,69.605537952772366,69.605537952772366,417.63322771663422,417.63322771663422,null,"R4","R-90265","HÁČEK"]
[7,"S101010230","Spojka hadicová opravná 1/2\" EXP STALCO GARDEN","ks",6,42.812173343554505,42.812173343554505,256.87304006132706,256.87304006132706,null,"R4","R-90265","HÁČEK"]
[8,"S101010233","Spojka hadicová opravná 3/4\" EXP STALCO GARDEN","ks",6,53.682079270425803,53.682079270425803,322.09247562255484,322.09247562255484,null,"R4","R-90265","HÁČEK"]
[9,"S101010236","Spojka hadicová opravná 1/2\" - 3/4\" EXP STALCO GARDEN","ks",6,49.772727138831748,49.772727138831748,298.63636283299047,298.63636283299047,null,"R4","R-90265","HÁČEK"]
[10,"S101010242","Konektor dvojitý EXP STALCO GARDEN","ks",6,21.551227251638071,21.551227251638071,129.30736350982843,129.30736350982843,null,"R4","R-90265","HÁČEK"]
[11,"S101010245","Konektor trojitý EXP STALCO GARDEN","ks",6,24.982951336293819,24.982951336293819,149.89770801776291,149.89770801776291,null,"R4","R-90265","HÁČEK"]
[12,"S101010251","Adaptér s vnitřním závitem 3/4\" EXP STALCO GARDEN","ks",6,28.891065753000035,28.891065753000035,173.34639451800021,173.34639451800021,null,"R4","R-90265","HÁČEK"]
[13,"S101010254","Adaptér s vnitřním závitem 1\" EXP STALCO GARDEN","ks",6,29.939916324891122,29.939916324891122,179.63949794934672,179.63949794934672,null,"R4","R-90265","HÁČEK"]
[14,"S101010257","Adaptér s vnitřním závitem 1/2\" - 3/4\" EXP STALCO GARDEN","ks",6,32.8957679365842,32.8957679365842,197.37460761950518,197.37460761950518,null,"R4","R-90265","HÁČEK"]
[15,"S101010260","Adaptér s vnitřním závitem 3/4\" - 1\" EXP STALCO GARDEN","ks",6,38.807471159970348,38.807471159970348,232.84482695982209,232.84482695982209,null,"R4","R-90265","HÁČEK"]
[16,"S101010263","Adaptér s vnějším závitem 1/2\" EXP STALCO GARDEN","ks",6,17.268143532363478,17.268143532363478,103.60886119418086,103.60886119418086,null,"R4","R-90265","HÁČEK"]
[17,"S101010266","Adaptér s vnějším závitem 3/4\" EXP STALCO GARDEN","ks",6,18.994957885599824,18.994957885599824,113.96974731359894,113.96974731359894,null,"R4","R-90265","HÁČEK"]
[18,"S101010272","Rozdělovač dvojitý EXP STALCO GARDEN","ks",4,193.6145029401811,193.6145029401811,774.45801176072439,774.45801176072439,null,"R4","R-90265","HÁČEK"]
[19,"S101010275","Rozdělovač 4ramenný EXP STALCO GARDEN","ks",4,324.18534211581363,324.18534211581363,1296.7413684632545,1296.7413684632545,null,"R4","R-90265","HÁČEK"]
[20,"S101010281","Hodiny s průtokem vody EXP STALCO GARDEN","ks",3,354.65492126471736,354.65492126471736,1063.9647637941521,1063.9647637941521,null,"R4","R-90265","HÁČEK"]
[21,"S101210200","Tryska nastavitelná EXP STALCO GARDEN","ks",6,47.763124071254502,47.763124071254502,286.578744427527,286.578744427527,null,"R4","R-90265","HÁČEK"]
[22,"S101210212","Zavlažovací tryska 1/2\", sada 4 ks EXP STALCO GARDEN","ks",6,179.24896562373098,179.24896562373098,1075.4937937423858,1075.4937937423858,null,"R4","R-90265","HÁČEK"]
[23,"S101210215","Zavlažovací tryska 3/4\", sada 4 ks EXP STALCO GARDEN","ks",6,192.60800032565274,192.60800032565274,1155.6480019539165,1155.6480019539165,null,"R4","R-90265","HÁČEK"]
[24,"S101210230","Pistole zavlažovací nastavitelná EXP STALCO GARDEN","ks",6,201.20902266798589,201.20902266798589,1207.2541360079153,1207.2541360079153,null,"R4","R-90265","HÁČEK"]
[25,"S101210233","Pistole zavlažovací 7-funkcí EXP STALCO GARDEN","ks",4,205.96703502757447,205.96703502757447,823.86814011029787,823.86814011029787,null,"R4","R-90265","HÁČEK"]
[26,"S101210251","Pistole zavlažovací nastavitelná, kovová EXP STALCO GARDEN","ks",6,173.91849482994081,173.91849482994081,1043.510968979645,1043.510968979645,null,"R4","R-90265","HÁČEK"]
[27,"S101210254","Pistole zavlažovací 7 funkcí, kovová EXP STALCO GARDEN","ks",4,170.73944351908222,170.73944351908222,682.95777407632886,682.95777407632886,null,"R4","R-90265","HÁČEK"]
[28,"S101410215","Zavlačovač s 8 funkcemi na podstavci EXP STALCO GARDEN","ks",5,170.81464919389126,170.81464919389126,854.07324596945625,854.07324596945625,null,"R4","R-90265","HÁČEK"]
[29,"S101410230","Zavlažovač otočný 3ramenný na podstavci EXP STALCO GARDEN","ks",3,185.01885243176287,185.01885243176287,555.0565572952886,555.0565572952886,null,"R4.1","R-92625","POLICE"]
[30,"S101410251","Zavlažovač pulzující, kovový EXP STALCO GARDEN","ks",5,382.67300202384138,382.67300202384138,1913.365010119207,1913.365010119207,null,"R4","R-90265","HÁČEK"]
[31,"S101410281","Zavlažovač vahadlový EXP STALCO GARDEN","ks",4,498.23974434380227,498.23974434380227,1992.9589773752091,1992.9589773752091,null,"R4","R-90265","HÁČEK"]
[32,"S101410284","Zavlažovač vahadlový nastavitelný EXP STALCO GARDEN","ks",4,509.6703457659948,509.6703457659948,2038.6813830639792,2038.6813830639792,null,"R4","R-90265","HÁČEK"]
[33,"S101610203","Závěs na hadici EXP STALCO GARDEN","ks",5,78.909864000000013,78.909864000000013,394.54932000000008,394.54932000000008,null,"R4.1","R-92625","POLICE"]
[34,"S101610215","Vozík na hadice 60m EXP STALCO GARDEN","ks",1,1375.6812116356148,1375.6812116356148,1375.6812116356148,1375.6812116356148,null,"R4",null,"PODESTA"]
[35,"S101610218","Vozík na hadice kovový 60 m EXP STALCO GARDEN","ks",1,1727.7429420605961,1727.7429420605961,1727.7429420605961,1727.7429420605961,null,"R4",null,"PODESTA"]
[36,"S101210400","Tryska nastavitelná STR STALCO GARDEN","ks",6,35.394981148303479,35.394981148303479,212.36988688982086,212.36988688982086,null,"R4.1","R-92625","POLICE"]
[37,"S101210500","Tryska nastavitelná STR HF STALCO GARDEN","ks",20,45.556640104559392,45.556640104559392,911.13280209118784,911.13280209118784,null,"R4.1","R-92625","POLICE"]
[null,null,"SUMA",null,179,null,null,{"$f":"SUM(H5:H39)","v":24445.410340704122},{"$f":"SUM(I5:I39)","v":24445.410340704122}]
[]
[]
[]
[]
[]
[]
[]
[]
[]
[]
[]
[null,null,"Specifikace regálových prvků",null,null,null,null,"rabat",0]
["Poz.","Kat. číslo","Popis","MJ","Množství","cena","Cena po odečtení rabatu","Celkem","Celkem po odečtení rabatu"]
[1,"R-90265","DVOJITÝ HÁČEK S CENOVKOU","ks",31,78.780479999999997,{"$f":"F56-(F56*$I$54)","v":78.780479999999997},{"$f":"F56*E56","v":2442.19488},{"$f":"H56-(H56*$I$54)","v":2442.19488}]
[2,"R-90305","CENOVÁ LIŠTA STŘÍBNRÁ 950mm BU","ks",2,26.30808,{"$f":"F57-(F57*$I$54)","v":26.30808},52.616160000000001,{"$f":"H57-(H57*$I$54)","v":52.616160000000001}]
[3,"R-90315","CENOVÁ LIŠTA TRANSPARENTNÍ 65MM BU","ks",31,2.7314400000000001,2.7314400000000001,84.674639999999997,84.674639999999997]
[4,"R-91084","GRAFIKA LOGO STALCO DO CENOVÉ LIŠTY (POZADÍ POD CENOVKY) R-91084 BU","ks",2,27.170639999999999,27.170639999999999,54.341279999999998,54.341279999999998]
[5,"R-91832","TYČ FI 5 934 x 81MM PRO NOSNÍKY ZA CENOVOU LIŠTU R-91832","ks",1,65.410799999999995,65.410799999999995,65.410799999999995,65.410799999999995]
[6,"R-92625","POLICE PLECHOVÁ 40CM 1M R-92625","ks",1,1320.6045179999999,1320.6045179999999,1320.6045179999999,1320.6045179999999]
[7,"SZKIELET",null,"bal.",null,0,{"$f":"F62-(F62*$I$54)","v":0},0,{"$f":"H62-(H62*$I$54)","v":0}]
[null,null,"SUMA",null,68,null,null,{"$f":"SUM(H56:H62)","v":4019.8422780000001},{"$f":"SUM(I56:I62)","v":4019.8422780000001}]

{"sheet":"Regál 5","index":5,"n_rows":58,"n_cols":13,"rows_kept":58,"cut":false,"hidden":false,"merged":[[0,0,0,12]]}
["Regál 5"]
[]
[null,null,"Specifikace",null,null,null,null,"rabat",0,null,"Prvky regálu a umístění produktu"]
["Poz.","Kat. číslo","Popis","MJ","Množství","Kat. cena bez DPH","Cena po odečtení rabatu","Celkem","Celkem po odečtení rabatu","Obrázek","Místo na regálu","Kat. číslo","Cílová pozice"]
[1,"S101010000","Rychlospojka průchozí 1/2\" XTR STALCO GARDEN","ks",6,84.406799869389289,{"$f":"F5-(F5*$I$3)","v":84.406799869389289},{"$f":"F5*E5","v":506.44079921633573},{"$f":"H5-(H5*$I$3)","v":506.44079921633573},null,"R5","R-90265","HÁČEK"]
[2,"S101010003","Rychlospojka s funkcí stop 1/2\" XTR STALCO GARDEN","ks",6,88.103448038851582,{"$f":"F6-(F6*$I$3)","v":88.103448038851582},{"$f":"F6*E6","v":528.62068823310949},{"$f":"H6-(H6*$I$3)","v":528.62068823310949},null,"R5","R-90265","HÁČEK"]
[3,"S101010006","Rychlospojka průchozí 3/4\" XTR STALCO GARDEN","ks",6,102.80202528409455,102.80202528409455,616.81215170456733,616.81215170456733,null,"R5","R-90265","HÁČEK"]
[4,"S101010009","Rychlospojka s funkcí stop 3/4\" XTR STALCO GARDEN","ks",6,106.41065802095063,106.41065802095063,638.46394812570384,638.46394812570384,null,"R5","R-90265","HÁČEK"]
[5,"S101010012","Rychlospojka s ventilem 1/2\" XTR STALCO GARDEN","ks",6,101.83385552542588,101.83385552542588,611.00313315255528,611.00313315255528,null,"R5","R-90265","HÁČEK"]
[6,"S101010015","Rychlospojka s ventilem 3/4\" XTR STALCO GARDEN","ks",6,116.53243277066885,116.53243277066885,699.19459662401312,699.19459662401312,null,"R5","R-90265","HÁČEK"]
[7,"S101010030","Spojka hadicová opravná 1/2\" XTR STALCO GARDEN","ks",6,123.83771367698721,123.83771367698721,743.02628206192321,743.02628206192321,null,"R5","R-90265","HÁČEK"]
[8,"S101010033","Spojka hadicová opravná 3/4\" XTR STALCO GARDEN","ks",6,161.42030339985394,161.42030339985394,968.52182039912361,968.52182039912361,null,"R5","R-90265","HÁČEK"]
[9,"S101010036","Spojka hadicová opravná 1/2\" - 3/4\" XTR STALCO GARDEN","ks",6,143.11309341775492,143.11309341775492,858.67856050652949,858.67856050652949,null,"R5","R-90265","HÁČEK"]
[10,"S101010042","Adaptér dvojitý XTR STALCO GARDEN","ks",6,42.00939408676679,42.00939408676679,252.05636452060074,252.05636452060074,null,"R5","R-90265","HÁČEK"]
[11,"S101010045","Adaptér trojitý XTR STALCO GARDEN","ks",6,83.931268602519481,83.931268602519481,503.58761161511688,503.58761161511688,null,"R5","R-90265","HÁČEK"]
[12,"S101010051","Adaptér s vnitřním závitem 3/4\" XTR STALCO GARDEN","ks",6,38.421091675188784,38.421091675188784,230.52655005113269,230.52655005113269,null,"R5","R-90265","HÁČEK"]
[13,"S101010054","Adaptér s vnitřním závitem 1\" XTR STALCO GARDEN","ks",6,42.00939408676679,42.00939408676679,252.05636452060074,252.05636452060074,null,"R5","R-90265","HÁČEK"]
[14,"S101010057","Adaptér s vnitřním závitem 1/2\" - 3/4\" XTR STALCO GARDEN","ks",6,61.176180138854136,61.176180138854136,367.05708083312481,367.05708083312481,null,"R5","R-90265","HÁČEK"]
[15,"S101010060","Adaptér s vnitřním závitem 3/4\" - 1\" XTR STALCO GARDEN","ks",6,73.954037506912371,73.954037506912371,443.72422504147426,443.72422504147426,null,"R5","R-90265","HÁČEK"]
[16,"S101010066","Adaptér s vnějším závitem 3/4\" XTR STALCO GARDEN","ks",6,42.972109367921867,42.972109367921867,257.83265620753122,257.83265620753122,null,"R5","R-90265","HÁČEK"]
[17,"S101010072","Rozdělovač dvojitý XTR STALCO GARDEN","ks",4,319.43436823604685,319.43436823604685,1277.7374729441874,1277.7374729441874,null,"R5","R-90265","HÁČEK"]
[18,"S101010075","Rozdělovač 4ramenný XTR STALCO GARDEN","ks",4,728.06035277491378,728.06035277491378,2912.2414110996551,2912.2414110996551,null,"R5","R-90265","HÁČEK"]
[19,"S101210000","Tryska rozprašovací nastavitelná XTR STALCO GARDEN","ks",6,160.05503114947354,160.05503114947354,960.33018689684127,960.33018689684127,null,"R5","R-90265","HÁČEK"]
[20,"S101210030","Pistole zavlažovací nastavitelná XTR STALCO GARDEN","ks",6,305.06179243977493,305.06179243977493,1830.3707546386495,1830.3707546386495,null,"R5","R-90265","HÁČEK"]
[21,"S101210033","Pistole zavlažovací 8 funkcí XTR STALCO GARDEN","ks",4,388.05250801952172,388.05250801952172,1552.2100320780869,1552.2100320780869,null,"R5","R-90265","HÁČEK"]
[22,"S101210039","Pistole zavlažovací 6 funkcí XTR STALCO GARDEN","ks",3,429.95961687897488,429.95961687897488,1289.8788506369247,1289.8788506369247,null,"R5","R-90265","HÁČEK"]
[23,"S101210039","Pistole zavlažovací 6 funkcí XTR STALCO GARDEN","ks",1,429.95961687897488,429.95961687897488,429.95961687897488,429.95961687897488,null,"R5","R-90440","HÁČEK"]
[24,"S101410042","Zavlažovač turbínový 6 funkcí XTR STALCO GARDEN","ks",3,726.70890177008539,726.70890177008539,2180.1267053102561,2180.1267053102561,null,"R5","R-90265","HÁČEK"]
[25,"S101410081","Zavlažovač vahadlový nastavitelný XTR STALCO GARDEN","ks",3,832.27804857599983,832.27804857599983,2496.8341457279994,2496.8341457279994,null,"R5.1","R-92625","POLICE"]
[26,"S101410084","Zavlažovač vahadlový nastavitelný s kovovou základnou XTR STALCO GARDEN","ks",3,1117.0694267073948,1117.0694267073948,3351.2082801221841,3351.2082801221841,null,"R5.1","R-92625","POLICE"]
[27,"S101610230","Naviják na hadici automatický 25 m EXP STALCO GARDEN","ks",1,2623.315450722087,2623.315450722087,2623.315450722087,2623.315450722087,null,"R5","R-92677","POLICE"]
[28,"S101610233","Naviják na hadici automatický 35 m EXP STALCO GARDEN","ks",1,3546.04336163383,3546.04336163383,3546.04336163383,3546.04336163383,null,"R5","R-92677","POLICE"]
[null,null,"SUMA",null,135,null,null,{"$f":"SUM(H5:H32)","v":32927.85910150312},{"$f":"SUM(I5:I32)","v":32927.85910150312}]
[]
[]
[]
[]
[]
[]
[]
[]
[]
[]
[]
[null,null,"Specifikace regálových prvků",null,null,null,null,"rabat",0]
["Poz.","Kat. číslo","Popis","MJ","Množství","cena","Cena po odečtení rabatu","Celkem","Celkem po odečtení rabatu"]
[1,"R-90265","DVOJITÝ HÁČEK S CENOVKOU","ks",23,78.780479999999997,{"$f":"F47-(F47*$I$45)","v":78.780479999999997},{"$f":"F47*E47","v":1811.9510399999999},{"$f":"H47-(H47*$I$45)","v":1811.9510399999999}]
[2,"R-90277","SYSTÉMOVÁ HRAZDA","ks",2,422.79816,{"$f":"F48-(F48*$I$45)","v":422.79816},845.59631999999999,{"$f":"H48-(H48*$I$45)","v":845.59631999999999}]
[3,"R-90305","CENOVÁ LIŠTA STŘÍBNRÁ 950mm BU","ks",2,26.30808,26.30808,52.616160000000001,52.616160000000001]
[4,"R-90315","CENOVÁ LIŠTA TRANSPARENTNÍ 65MM BU","ks",23,2.7314400000000001,2.7314400000000001,62.823120000000003,62.823120000000003]
[5,"R-92658","GRAFIKA MAGNETICKÁ VIP (180MM X 295MM) R-92658","ks",1,0,0,0,0]
[6,"R-92677","DRŽÁK NOSNÍKU PRO AUTOMATICKÉ NAVÍJEČE R-92677","ks",2,179.56,179.56,359.12,359.12]
[7,"R-91084","GRAFIKA LOGO STALCO DO CENOVÉ LIŠTY (POZADÍ POD CENOVKY) R-91084 BU","ks",2,27.170639999999999,27.170639999999999,54.341279999999998,54.341279999999998]
[8,"R-91832","TYČ FI 5 934 x 81MM PRO NOSNÍKY ZA CENOVOU LIŠTU R-91832","ks",1,65.410799999999995,65.410799999999995,65.410799999999995,65.410799999999995]
[9,"R-92625","POLICE PLECHOVÁ 40CM 1M R-92625","ks",1,1320.6045179999999,1320.6045179999999,1320.6045179999999,1320.6045179999999]
[10,"R-90440","HÁK NA ELEKTRONÁŘADÍ","ks",2,27.81756,27.81756,55.635120000000001,55.635120000000001]
[11,"SZKIELET",null,"bal.",null,0,{"$f":"F57-(F57*$I$45)","v":0},0,{"$f":"H57-(H57*$I$45)","v":0}]
[null,null,"SUMA",null,59,null,null,{"$f":"SUM(H47:H57)","v":4628.0983580000002},{"$f":"SUM(I47:I57)","v":4628.0983580000002}]

{"sheet":"Regál 6","index":6,"n_rows":61,"n_cols":13,"rows_kept":61,"cut":false,"hidden":false,"merged":[[0,1,0,12]]}
[null,"Regál 6"]
[]
[null,null,"Specifikace",null,null,null,null,"rabat",0,null,"Prvky regálu a umístění produktu"]
["Poz.","Kat. číslo","Popis","MJ","Množství","Kat. cena bez DPH","Cena po odečtení rabatu","Celkem","Celkem po odečtení rabatu","Obrázek","Místo na regálu","Kat. číslo","Cílová pozice"]
[1,"S101010600","Rychlospojka průchozí 1/2\" BRS STALCO GARDEN","ks",6,105.63912114325859,{"$f":"F5-(F5*$I$3)","v":105.63912114325859},{"$f":"F5*E5","v":633.83472685955155},{"$f":"H5-(H5*$I$3)","v":633.83472685955155},null,"R6","R-90265","HÁČEK"]
[2,"S101010603","Rychlospojka s funkcí stop 1/2\" BRS STALCO GARDEN","ks",6,105.09104530066222,{"$f":"F6-(F6*$I$3)","v":105.09104530066222},{"$f":"F6*E6","v":630.54627180397324},{"$f":"H6-(H6*$I$3)","v":630.54627180397324},null,"R6","R-90265","HÁČEK"]
[3,"S101010606","Rychlospojka průchozí 3/4\" BRS STALCO GARDEN","ks",6,136.52995711667666,136.52995711667666,819.17974270005993,819.17974270005993,null,"R6","R-90265","HÁČEK"]
[4,"S101010609","Rychlospojka s funkcí stop 3/4\" BRS STALCO GARDEN","ks",6,127.69354147588004,127.69354147588004,766.16124885528029,766.16124885528029,null,"R6","R-90265","HÁČEK"]
[5,"S101010630","Spojka hadicová opravná 1/2\" BRS STALCO GARDEN","ks",6,103.36325945962338,103.36325945962338,620.17955675774033,620.17955675774033,null,"R6","R-90265","HÁČEK"]
[6,"S101010633","Spojka hadicová opravná 3/4\" BRS STALCO GARDEN","ks",6,176.29230487598483,176.29230487598483,1057.7538292559088,1057.7538292559088,null,"R6","R-90265","HÁČEK"]
[7,"S101010642","Konektor dvojitý BRS STALCO GARDEN","ks",6,55.780355150498679,55.780355150498679,334.68213090299207,334.68213090299207,null,"R6","R-90265","HÁČEK"]
[8,"S101010645","Konektor trojitý BRS STALCO GARDEN","ks",6,124.18666906817107,124.18666906817107,745.12001440902645,745.12001440902645,null,"R6","R-90265","HÁČEK"]
[9,"S101010651","Adaptér s vnitřním závitem 3/4\" BRS STALCO GARDEN","ks",6,48.054022173571497,48.054022173571497,288.32413304142898,288.32413304142898,null,"R6","R-90265","HÁČEK"]
[10,"S101010654","Adaptér s vnitřním závitem 1\" BRS STALCO GARDEN","ks",6,55.577412070429304,55.577412070429304,333.4644724225758,333.4644724225758,null,"R6","R-90265","HÁČEK"]
[11,"S101010657","Adaptér s vnitřním závitem 1/2\" - 3/4\" BRS STALCO GARDEN","ks",6,80.104532890243163,80.104532890243163,480.62719734145901,480.62719734145901,null,"R6","R-90265","HÁČEK"]
[12,"S101010660","Adaptér s vnitřním závitem 3/4\" - 1\" BRS STALCO GARDEN","ks",6,110.71994611213849,110.71994611213849,664.31967667283095,664.31967667283095,null,"R6","R-90265","HÁČEK"]
[13,"S101010666","Adaptér s vnějším závitem 3/4\" BRS STALCO GARDEN","ks",6,48.054022173571497,48.054022173571497,288.32413304142898,288.32413304142898,null,"R6","R-90265","HÁČEK"]
[14,"S101010672","Rozdělovač dvojitý BRS STALCO GARDEN","ks",4,264.35766866117666,264.35766866117666,1057.4306746447066,1057.4306746447066,null,"R6","R-90265","2 X HÁČEK"]
[15,"S101210600","Tryska nastavitelná BRS STALCO GARDEN","ks",6,125.78656824936982,125.78656824936982,754.71940949621899,754.71940949621899,null,"R6","R-90265","HÁČEK"]
[16,"S101210603","Pistole zavlažovací nastavitelná BRS STALCO GARDEN","ks",6,415.68557980020921,415.68557980020921,2494.113478801255,2494.113478801255,null,"R6","R-90265","HÁČEK"]
[17,"S101210606","Pistole zavlažovací 8 funkcí BRS STALCO GARDEN","ks",4,413.76407480883688,413.76407480883688,1655.0562992353475,1655.0562992353475,null,"R6","R-90265","HÁČEK"]
[18,"S101010700","Konektor s vnitřním závitem 1/2\" BRS GK STALCO GARDEN","ks",6,74.625069728369851,74.625069728369851,447.75041837021911,447.75041837021911,null,"R6","R-90265","HÁČEK"]
[19,"S101010703","Konektor s vnitřním závitem 3/4\" BRS GK STALCO GARDEN","ks",6,74.625069728369851,74.625069728369851,447.75041837021911,447.75041837021911,null,"R6","R-90265","HÁČEK"]
[20,"S101010706","Konektor s vnitřním závitem 1\" BRS GK STALCO GARDEN","ks",6,76.603764759046314,76.603764759046314,459.62258855427785,459.62258855427785,null,"R6","R-90265","HÁČEK"]
[21,"S101010709","Konektor s vnějším závitem 1/2\" BRS GK STALCO GARDEN","ks",6,71.704138968799825,71.704138968799825,430.22483381279892,430.22483381279892,null,"R6","R-90265","HÁČEK"]
[22,"S101010712","Konektor s vnějším závitem 3/4\" BRS GK STALCO GARDEN","ks",6,73.682833999476301,73.682833999476301,442.09700399685778,442.09700399685778,null,"R6","R-90265","HÁČEK"]
[23,"S101010715","Konektor s vnějším závitem 1\" BRS GK STALCO GARDEN","ks",6,75.661529030152778,75.661529030152778,453.96917418091664,453.96917418091664,null,"R6","R-90265","HÁČEK"]
[24,"S101010718","Spojka s konektorem na hadici 1/2\" BRS GK STALCO GARDEN","ks",6,77.640224060829226,77.640224060829226,465.84134436497538,465.84134436497538,null,"R6","R-90265","HÁČEK"]
[25,"S101010721","Spojka s konektorem na hadici 3/4\" BRS GK STALCO GARDEN","ks",6,79.618919091505703,79.618919091505703,477.71351454903424,477.71351454903424,null,"R6","R-90265","HÁČEK"]
[26,"S101010724","Spojka s konektorem na hadici 1\" BRS GK STALCO GARDEN","ks",6,99.688540116938526,99.688540116938526,598.13124070163121,598.13124070163121,null,"R6","R-90265","HÁČEK"]
[27,"S101010727","Spojka s otočným konektorem na hadici 1/2\" BRS GK STALCO GARDEN","ks",6,128.52095342108143,128.52095342108143,771.12572052648852,771.12572052648852,null,"R6","R-90265","HÁČEK"]
[28,"S101010730","Spojka s otočným konektorem na hadici 3/4\" BRS GK STALCO GARDEN","ks",6,133.70324992999602,133.70324992999602,802.21949957997617,802.21949957997617,null,"R6","R-90265","HÁČEK"]
[29,"S101010733","Spojka s otočným konektorem na hadici 1\" BRS GK STALCO GARDEN","ks",6,139.92200574069349,139.92200574069349,839.5320344441609,839.5320344441609,null,"R6","R-90265","HÁČEK"]
[30,"S101010736","Spojka 3ramenná BRS GK STALCO GARDEN S101010736","ks",3,385.56286026324415,385.56286026324415,1156.6885807897324,1156.6885807897324,null,"R6","R-90265","HÁČEK"]
[31,"S101010739","Spojka s konektorem pro rychlospojku BRS GK STALCO GARDEN","ks",6,79.147801227058935,79.147801227058935,474.88680736235358,474.88680736235358,null,"R6","R-90265","HÁČEK"]
[32,"S101010742","Konektor uzavírací BRS GK STALCO GARDEN","ks",6,88.758605661773245,88.758605661773245,532.5516339706395,532.5516339706395,null,"R6","R-90265","HÁČEK"]
[33,"S101610006","Závěs kovový na hadici XTR STALCO GARDEN","ks",5,166.27007770185614,166.27007770185614,831.35038850928072,831.35038850928072,null,"R6","R-90261","2 X HÁČEK"]
[34,"S101610012","Naviják kovový na hadici 60 m XTR STALCO GARDEN","ks",1,2657.5488006187761,2657.5488006187761,2657.5488006187761,2657.5488006187761,null,"R6",null,"PODESTA"]
[35,"S101610015","Vozík na hadice kovový 60 m XTR STALCO GARDEN","ks",1,3127.8103657282704,3127.8103657282704,3127.8103657282704,3127.8103657282704,null,"R6",null,"PODESTA"]
[null,null,"SUMA",null,192,null,null,{"$f":"SUM(H5:H39)","v":29040.651364672391},{"$f":"SUM(I5:I39)","v":29040.651364672391}]
[]
[]
[]
[]
[]
[]
[]
[]
[]
[]
[]
[null,null,"Specifikace regálových prvků",null,null,null,null,"rabat",0]
["Poz.","Kat. číslo","Popis","MJ","Množství","cena","Cena po odečtení rabatu","Celkem","Celkem po odečtení rabatu"]
[1,"R-90261","JEDNODUCHÝ HÁČEK S CENOVKOU","ks",3,69.867360000000005,{"$f":"F54-(F54*$I$52)","v":69.867360000000005},{"$f":"F54*E54","v":209.60208},{"$f":"H54-(H54*$I$52)","v":209.60208}]
[2,"R-90265","DVOJITÝ HÁČEK S CENOVKOU","ks",33,78.780479999999997,{"$f":"F55-(F55*$I$52)","v":78.780479999999997},2599.7558399999998,{"$f":"H55-(H55*$I$52)","v":2599.7558399999998}]
[3,"R-90305","CENOVÁ LIŠTA STŘÍBNRÁ 950mm BU","ks",1,26.30808,26.30808,26.30808,26.30808]
[4,"R-90315","CENOVÁ LIŠTA TRANSPARENTNÍ 65MM BU","ks",34,2.7314400000000001,2.7314400000000001,92.868960000000001,92.868960000000001]
[5,"R-92662","GRAFIKA MAGNETICKÁ (150MM X 100MM) R-92662","ks",2,0,0,0,0]
[6,"R-91084","GRAFIKA LOGO STALCO DO CENOVÉ LIŠTY (POZADÍ POD CENOVKY) R-91084 BU","ks",1,27.170639999999999,27.170639999999999,27.170639999999999,27.170639999999999]
[7,"SZKIELET",null,"bal.",null,0,{"$f":"F60-(F60*$I$52)","v":0},0,{"$f":"H60-(H60*$I$52)","v":0}]
[null,null,"SUMA",null,74,null,null,{"$f":"SUM(H54:H60)","v":2955.7055999999993},{"$f":"SUM(I54:I60)","v":2955.7055999999993}]

{"sheet":"Regál 7","index":7,"n_rows":43,"n_cols":18,"rows_kept":43,"cut":false,"hidden":false,"merged":[[0,1,0,12]]}
[null,"Regál 7"]
[]
[null,null,"Specifikace",null,null,null,null,"rabat",0,null,"Prvky regálu a umístění produktu"]
["Poz.","Kat. číslo","Popis","MJ","Množství","Kat. cena bez DPH","Cena po odečtení rabatu","Celkem","Celkem po odečtení rabatu","Obrázek","Místo na regálu","Kat. číslo","Cílová pozice",null,null,null,null,"Z:\\ZDJĘCIA KATALOG STALCO - MINIATURY EAN\\"]
[1,"S103210406","Postřikovač tlakový ruční 1,5l STR STALCO GARDEN","ks",4,106.02780283103651,{"$f":"F5-(F5*$I$3)","v":106.02780283103651},{"$f":"F5*E5","v":424.11121132414604},{"$f":"H5-(H5*$I$3)","v":424.11121132414604},null,"R7.1","R-92625","POLICE"]
[2,"S103210409","Postřikovač tlakový ruční 2l STR STALCO GARDEN","ks",4,114.57843209160397,{"$f":"F6-(F6*$I$3)","v":114.57843209160397},{"$f":"F6*E6","v":458.31372836641589},{"$f":"H6-(H6*$I$3)","v":458.31372836641589},null,"R7.1","R-92625","POLICE"]
[3,"S103210415","Postřikovač tlakový 5l STR STALCO GARDEN","ks",4,392.47388306004643,392.47388306004643,1569.8955322401857,1569.8955322401857,null,"R7.3","R-92625","POLICE"]
[4,"S103210418","Postřikovač tlakový 8l STR STALCO GARDEN","ks",4,435.22702936288374,435.22702936288374,1740.908117451535,1740.908117451535,null,"R7","R-92625","PODESTA"]
[5,"S103210206","Postřikovač tlakový ruční 1,5l EXP STALCO GARDEN","ks",4,235.99736759166191,235.99736759166191,943.98947036664765,943.98947036664765,null,"R7.1","R-92625","POLICE"]
[6,"S103210209","Postřikovač tlakový ruční 2l EXP STALCO GARDEN","ks",4,253.09862611279686,253.09862611279686,1012.3945044511875,1012.3945044511875,null,"R7.1","R-92625","POLICE"]
[7,"S103210215","Postřikovač tlakový 5l EXP STALCO GARDEN","ks",4,714.83260618343968,714.83260618343968,2859.3304247337587,2859.3304247337587,null,"R7.3","R-92625","POLICE"]
[8,"S103210218","Postřikovač tlakový 8l EXP STALCO GARDEN","ks",4,774.68701100741225,774.68701100741225,3098.748044029649,3098.748044029649,null,"R7","R-92625","PODESTA"]
[9,"S103410203","Sada těsnění NBR pro postřikovače EXP STALCO GARDEN","ks",3,63.349009826117182,63.349009826117182,190.04702947835153,190.04702947835153,null,"R7","R-90261","HÁČEK"]
[10,"S103410212","Trubice teleskopická s tryskou pro postřikovače EXP STALCO GARDEN","ks",3,122.68294156466358,122.68294156466358,368.04882469399075,368.04882469399075,null,"R7.2","R-92625","POLICE"]
[11,"S103410221","Ventil s rukojetí a hadicí 150 cm pro postřikovače EXP STALCO GARDEN","ks",2,158.93017429967784,158.93017429967784,317.86034859935569,317.86034859935569,null,"R7.2","R-92625","POLICE"]
[12,"S103410230","Pumpa pro postřikovače EXP STALCO GARDEN","ks",1,173.98671712806836,173.98671712806836,173.98671712806836,173.98671712806836,null,"R7.2","R-92625","POLICE"]
[13,"S103410403","Sada těsnění NBR pro postřikovače STR STALCO GARDEN","ks",3,63.349009826117182,63.349009826117182,190.04702947835153,190.04702947835153,null,"R7","R-90261","HÁČEK"]
[14,"S103410412","Trubice teleskopická s tryskou pro postřikovače STR STALCO GARDEN","ks",3,122.68294156466358,122.68294156466358,368.04882469399075,368.04882469399075,null,"R7.2","R-92625","POLICE"]
[15,"S103410421","Ventril s rukojetí a hadicí 150 cm pro postřikovače STR STALCO GARDEN","ks",2,144.98893094005697,144.98893094005697,289.97786188011395,289.97786188011395,null,"R7.2","R-92625","POLICE"]
[16,"S103410503","Kryt proti herbicidům - univerzální STALCO GARDEN","ks",5,83.647460157725178,83.647460157725178,418.23730078862587,418.23730078862587,null,"R7.2","R-92625","POLICE"]
[null,null,"SUMA",null,54,null,null,{"$f":"SUM(H5:H20)","v":14423.944969704375},{"$f":"SUM(I5:I20)","v":14423.944969704375}]
[]
[]
[]
[]
[]
[]
[]
[]
[]
[]
[]
[null,null,"Specifikace regálových prvků",null,null,null,null,"rabat",0]
["Poz.","Kat. číslo","Popis","MJ","Množství","cena","Cena po odečtení rabatu","Celkem","Celkem po odečtení rabatu"]
[1,"R-90261","JEDNODUCHÝ HÁČEK S CENOVKOU","ks",2,69.867360000000005,{"$f":"F35-(F35*$I$33)","v":69.867360000000005},{"$f":"F35*E35","v":139.73472000000001},{"$f":"H35-(H35*$I$33)","v":139.73472000000001}]
[2,"R-90305","CENOVÁ LIŠTA STŘÍBNRÁ 950mm BU","ks",4,26.30808,{"$f":"F36-(F36*$I$33)","v":26.30808},105.23232,{"$f":"H36-(H36*$I$33)","v":105.23232}]
[3,"R-90315","CENOVÁ LIŠTA TRANSPARENTNÍ 65MM BU","ks",2,2.7314400000000001,2.7314400000000001,5.4628800000000002,5.4628800000000002]
[4,"R-92625","POLICE PLECHOVÁ 40CM 1M R-92625","ks",3,1320.6045179999999,1320.6045179999999,3961.8135539999994,3961.8135539999994]
[5,"R-92627","OHRANIČENÍ POLICE 1000MM R-92627","ks",3,583.23432000000003,583.23432000000003,1749.7029600000001,1749.7029600000001]
[6,"R-91084","GRAFIKA LOGO STALCO DO CENOVÉ LIŠTY (POZADÍ POD CENOVKY) R-91084 BU","ks",4,27.170639999999999,27.170639999999999,108.68256,108.68256]
[7,"R-91832","TYČ FI 5 934 x 81MM PRO NOSNÍKY ZA CENOVOU LIŠTU R-91832","ks",2,65.410799999999995,65.410799999999995,130.82159999999999,130.82159999999999]
[8,"SZKIELET",null,"bal.",null,0,{"$f":"F42-(F42*$I$33)","v":0},0,{"$f":"H42-(H42*$I$33)","v":0}]
[null,null,"SUMA",null,20,null,null,{"$f":"SUM(H35:H42)","v":6201.4505939999999},{"$f":"SUM(I35:I42)","v":6201.4505939999999}]

{"sheet":"Regál 8","index":8,"n_rows":37,"n_cols":13,"rows_kept":37,"cut":false,"hidden":false,"merged":[[0,0,0,12]]}
["Regál 8"]
[]
[null,null,"Specifikace",null,null,null,null,"rabat",0,null,"Prvky regálu a umístění produktu"]
["Poz.","Kat. číslo","Popis","MJ","Množství","Kat. cena bez DPH","Cena po odečtení rabatu","Celkem","Celkem po odečtení rabatu","Obrázek","Místo na regálu","Kat. číslo","Cílová pozice"]
[1,"S104010406","Nůžky zahradnické STR STALCO GARDEN","ks",10,235.59661943999996,{"$f":"F5-(F5*$I$3)","v":235.59661943999996},{"$f":"F5*E5","v":2355.9661943999995},{"$f":"H5-(H5*$I$3)","v":2355.9661943999995},null,"R8","R-90265","HÁČEK"]
[2,"S104010412","Nůžky zahradnické STR STALCO GARDEN","ks",12,235.59661943999996,{"$f":"F6-(F6*$I$3)","v":235.59661943999996},{"$f":"F6*E6","v":2827.1594332799996},{"$f":"H6-(H6*$I$3)","v":2827.1594332799996},null,"R8","R-90265","HÁČEK"]
[3,"S104010415","Nůžky zahradnické kovadlinové STR STALCO GARDEN","ks",12,240.12732365999997,240.12732365999997,2881.5278839199996,2881.5278839199996,null,"R8","R-90265","HÁČEK"]
[4,"S104010421","Nůžky zahradnické STR STALCO GARDEN","ks",10,253.71943631999994,253.71943631999994,2537.1943631999993,2537.1943631999993,null,"R8","R-90265","HÁČEK"]
[5,"S104010424","Nůžky zahradnické kovadlinové STR STALCO GARDEN","ks",10,258.25014053999996,258.25014053999996,2582.5014053999994,2582.5014053999994,null,"R8","R-90265","HÁČEK"]
[6,"S104020406","Nůžky na větve 790mm STR STALCO GARDEN","ks",4,362.45633759999993,362.45633759999993,1449.8253503999997,1449.8253503999997,null,"R8","R-90265","HÁČEK"]
[7,"S104020409","Nůžky na větve teleskopické 650-990mm STR STALCO GARDEN","ks",4,489.31605575999993,489.31605575999993,1957.2642230399997,1957.2642230399997,null,"R8","R-90265","HÁČEK"]
[8,"S104020412","Nůžky na větve STR 730mm STALCO GARDEN","ks",4,416.82478823999986,416.82478823999986,1667.2991529599994,1667.2991529599994,null,"R8","R-90265","HÁČEK"]
[9,"S104020415","Nůžky na větve teleskopické 630-950mm STR STALCO GARDEN","ks",4,543.68450639999992,543.68450639999992,2174.7380255999997,2174.7380255999997,null,"R8","R-90265","HÁČEK"]
[10,"S104020421","Nůžky na větve kovadlinové 790mm STR STALCO GARDEN","ks",4,425.8861966799999,425.8861966799999,1703.5447867199996,1703.5447867199996,null,"R8","R-90265","HÁČEK"]
[11,"S104020424","Nůžky na větve kovadlinové STR teleskopické 650-990mm STALCO GARDEN","ks",4,552.74591483999984,552.74591483999984,2210.9836593599994,2210.9836593599994,null,"R8","R-90265","HÁČEK"]
[12,"S104040406","Nůžky na živý plot 630mm STR STALCO GARDEN","ks",5,380.57915448,380.57915448,1902.8957723999999,1902.8957723999999,null,"R8","R-90265","HÁČEK"]
[13,"S104040409","Nůžky na živý plot teleskopické 690-860mm STR STALCO GARDEN","ks",5,498.37746419999985,498.37746419999985,2491.8873209999992,2491.8873209999992,null,"R8","R-90265","HÁČEK"]
[null,null,"SUMA",null,88,null,null,{"$f":"SUM(H5:H17)","v":28742.787571679994},{"$f":"SUM(I5:I17)","v":28742.787571679994}]
[]
[]
[]
[]
[]
[]
[]
[]
[]
[]
[]
[null,null,"Specifikace regálových prvků",null,null,null,null,"rabat",0]
["Poz.","Kat. číslo","Popis","MJ","Množství","cena","Cena po odečtení rabatu","Celkem","Celkem po odečtení rabatu"]
[1,"R-90265","DVOJITÝ HÁČEK S CENOVKOU","ks",13,78.780479999999997,{"$f":"F32-(F32*$I$30)","v":78.780479999999997},{"$f":"F32*E32","v":1024.14624},{"$f":"H32-(H32*$I$30)","v":1024.14624}]
[2,"R-90305","CENOVÁ LIŠTA STŘÍBNRÁ 950mm BU","ks",1,26.30808,{"$f":"F33-(F33*$I$30)","v":26.30808},26.30808,{"$f":"H33-(H33*$I$30)","v":26.30808}]
[3,"R-90315","CENOVÁ LIŠTA TRANSPARENTNÍ 65MM BU","ks",13,2.7314400000000001,2.7314400000000001,35.508720000000004,35.508720000000004]
[4,"R-91084","GRAFIKA LOGO STALCO DO CENOVÉ LIŠTY (POZADÍ POD CENOVKY) R-91084 BU","ks",1,27.170639999999999,27.170639999999999,27.170639999999999,27.170639999999999]
[5,"SZKIELET",null,"bal.",null,0,{"$f":"F36-(F36*$I$30)","v":0},0,{"$f":"H36-(H36*$I$30)","v":0}]
[null,null,"SUMA",null,28,null,null,{"$f":"SUM(H32:H36)","v":1113.1336800000001},{"$f":"SUM(I32:I36)","v":1113.1336800000001}]

{"sheet":"Regál 9","index":9,"n_rows":46,"n_cols":13,"rows_kept":46,"cut":false,"hidden":false,"merged":[[0,0,0,12]]}
["Regál 9"]
[]
[null,null,"Specifikace",null,null,null,null,"rabat",0,null,"Prvky regálu a umístění produktu"]
["Poz.","Kat. číslo","Popis","MJ","Množství","Kat. cena bez DPH","Cena po odečtení rabatu","Celkem","Celkem po odečtení rabatu","Obrázek","Místo na regálu","Kat. číslo","Cílová pozice"]
[1,"S104070212","Pilka zahradní skládací 230mm EXP STALCO GARDEN","ks",6,308.08788695999993,{"$f":"F5-(F5*$I$3)","v":308.08788695999993},{"$f":"F5*E5","v":1848.5273217599997},{"$f":"H5-(H5*$I$3)","v":1848.5273217599997},null,"R9","R-90265","HÁČEK"]
[2,"S104070221","Pilka zahradní 270mm EXP STALCO GARDEN","ks",6,308.08788695999993,{"$f":"F6-(F6*$I$3)","v":308.08788695999993},{"$f":"F6*E6","v":1848.5273217599997},{"$f":"H6-(H6*$I$3)","v":1848.5273217599997},null,"R9","R-90265","HÁČEK"]
[3,"S104070257","Pila oblouková 533mm EXP STALCO GARDEN","ks",5,208.41239411999993,208.41239411999993,1042.0619705999998,1042.0619705999998,null,"R9","R-98020","HÁČEK NA PILY"]
[4,"S104070260","Pila oblouková 610mm EXP STALCO GARDEN","ks",5,217.47380255999997,217.47380255999997,1087.3690127999998,1087.3690127999998,null,"R9","R-98020","HÁČEK NA PILY"]
[5,"S104097257","Pilový list do obloukové pily 533mm EXP na mokré dřevo STALCO GARDEN","ks",10,50.743887263999994,50.743887263999994,507.43887263999994,507.43887263999994,null,"R9","R-90261","HÁČEK"]
[6,"S104097258","Pilový list do obloukové pily 533mm EXP na suché dřevoSTALCO GARDEN","ks",10,57.993014015999989,57.993014015999989,579.93014015999984,579.93014015999984,null,"R9","R-90261","HÁČEK"]
[7,"S104097260","Pilový list do obloukové pily 610mm EXP na mokré dřevo STALCO GARDEN","ks",10,50.743887263999994,50.743887263999994,507.43887263999994,507.43887263999994,null,"R9","R-90261","HÁČEK"]
[8,"S104097261","Pilový list do obloukové pily 610mm EXP na suché dřevo STALCO GARDEN","ks",10,57.993014015999989,57.993014015999989,579.93014015999984,579.93014015999984,null,"R9","R-90261","HÁČEK"]
[9,"S104210203","Sekera univerzální 630g EXP STALCO GARDEN","ks",4,517.68220392000001,517.68220392000001,2070.72881568,2070.72881568,null,"R9","R-90265","HÁČEK"]
[10,"S104210206","Sekera univerzální 950g EXP STALCO GARDEN","ks",4,635.87448791999986,635.87448791999986,2543.4979516799995,2543.4979516799995,null,"R9","R-90265","HÁČEK"]
[11,"S104210209","Sekera štípací 1240g EXP STALCO GARDEN","ks",3,769.82574311999997,769.82574311999997,2309.4772293599999,2309.4772293599999,null,"R9","R-90265","HÁČEK"]
[12,"S104210212","Sekera štípací 1710g EXP STALCO GARDEN","ks",3,958.93339751999986,958.93339751999986,2876.8001925599997,2876.8001925599997,null,"R9","R-90265","HÁČEK"]
[13,"S104210215","Sekera štípací 2300g EXP STALCO GARDEN","ks",2,1155.9205375199999,1155.9205375199999,2311.8410750399999,2311.8410750399999,null,"R9","R-90265","HÁČEK"]
[14,"S104210251","Brousek na sekery a nože EXP STALCO GARDEN","ks",12,118.192284,118.192284,1418.3074080000001,1418.3074080000001,null,"R9","R-90265","HÁČEK"]
[15,null,{"$error":"#N/A"},null,null,null,null,null,null,null,"R9","R-90265","HÁČEK"]
[16,"S105610451","Set drobného zahradnického nářadí STR STALCO GARDEN","ks",4,416.71773240864769,416.71773240864769,1666.8709296345908,1666.8709296345908,null,"R9",null,"PODESTA"]
[17,"S-76353","Rukavice kožené \"SKIN COMFORT GRIP\"","pár",6,278.7,278.7,1672.1999999999998,1672.1999999999998,null,"R9","R-90265","HÁČEK"]
[18,"S-76354","Rukavice kožené \"SKIN COMFORT GRIP\"","pár",6,278.7,278.7,1672.1999999999998,1672.1999999999998,null,"R9","R-90265","HÁČEK"]
[19,"S-76355","Rukavice kožené \"SKIN COMFORT GRIP\"","pár",6,278.7,278.7,1672.1999999999998,1672.1999999999998,null,"R9","R-90265","HÁČEK"]
[20,"S-76356","Rukavice kožené \"SKIN COMFORT GRIP\"","pár",6,278.7,278.7,1672.1999999999998,1672.1999999999998,null,"R9","R-90265","HÁČEK"]
[null,null,"SUMA",null,118,null,null,{"$f":"SUM(H5:H24)","v":29887.547254474594},{"$f":"SUM(I5:I24)","v":29887.547254474594}]
[]
[]
[]
[]
[]
[]
[]
[]
[]
[]
[]
[null,null,"Specifikace regálových prvků",null,null,null,null,"rabat",0]
["Poz.","Kat. číslo","Popis","MJ","Množství","cena","Cena po odečtení rabatu","Celkem","Celkem po odečtení rabatu"]
[1,"R-90261","JEDNODUCHÝ HÁČEK S CENOVKOU","ks",4,69.867360000000005,{"$f":"F39-(F39*$I$37)","v":69.867360000000005},{"$f":"F39*E39","v":279.46944000000002},{"$f":"H39-(H39*$I$37)","v":279.46944000000002}]
[2,"R-90265","DVOJITÝ HÁČEK S CENOVKOU","ks",14,78.780479999999997,{"$f":"F40-(F40*$I$37)","v":78.780479999999997},1102.9267199999999,{"$f":"H40-(H40*$I$37)","v":1102.9267199999999}]
[3,"R-90305","CENOVÁ LIŠTA STŘÍBNRÁ 950mm BU","ks",1,26.30808,26.30808,26.30808,26.30808]
[4,"R-90315","CENOVÁ LIŠTA TRANSPARENTNÍ 65MM BU","ks",21,2.7314400000000001,2.7314400000000001,57.360240000000005,57.360240000000005]
[5,"R-98020","HÁK PRO OBLOUKOVÉ PILY 100X50X76MM NA PERFOROVANÝ PLECH R-98020","bal.",3,70.442400000000006,70.442400000000006,211.3272,211.3272]
[6,"R-91084","GRAFIKA LOGO STALCO DO CENOVÉ LIŠTY (POZADÍ POD CENOVKY) R-91084 BU","ks",1,27.170639999999999,27.170639999999999,27.170639999999999,27.170639999999999]
[7,"SZKIELET",null,"bal.",null,0,{"$f":"F45-(F45*$I$37)","v":0},0,{"$f":"H45-(H45*$I$37)","v":0}]
[null,null,"SUMA",null,44,null,null,{"$f":"SUM(H39:H45)","v":1704.56232},{"$f":"SUM(I39:I45)","v":1704.56232}]

{"sheet":"Regál 10","index":10,"n_rows":50,"n_cols":13,"rows_kept":50,"cut":false,"hidden":false,"merged":[[0,0,0,12]]}
["Regál 10"]
[]
[null,null,"Specifikace",null,null,null,null,"rabat",0,null,"Prvky regálu a umístění produktu"]
["Poz.","Kat. číslo","Popis","MJ","Množství","Kat. cena bez DPH","Cena po odečtení rabatu","Celkem","Celkem po odečtení rabatu","Obrázek","Místo na regálu","Kat. číslo","Cílová pozice"]
[1,"S105610000","Lopatka široká XTR STALCO GARDEN","ks",6,193.40905917722318,{"$f":"F5-(F5*$I$3)","v":193.40905917722318},{"$f":"F5*E5","v":1160.4543550633391},{"$f":"H5-(H5*$I$3)","v":1160.4543550633391},null,"R10","R-90265","HÁČEK"]
[2,"S105610003","Lopatka úzká XTR STALCO GARDE","ks",6,183.40514232322886,{"$f":"F6-(F6*$I$3)","v":183.40514232322886},{"$f":"F6*E6","v":1100.4308539393733},{"$f":"H6-(H6*$I$3)","v":1100.4308539393733},null,"R10","R-90265","HÁČEK"]
[3,"S105610006","Vidle ruční XTR STALCO GARDEN","ks",6,229.25642790403612,229.25642790403612,1375.5385674242166,1375.5385674242166,null,"R10","R-90265","HÁČEK"]
[4,"S105610009","Hrábě ruční XTR STALCO GARDEN","ks",6,267.60477584434756,267.60477584434756,1605.6286550660852,1605.6286550660852,null,"R10","R-90265","HÁČEK"]
[5,"S105610012","Hrábě vějířové ruční XTR STALCO GARDEN","ks",6,221.75349026354039,221.75349026354039,1330.5209415812424,1330.5209415812424,null,"R10","R-90265","HÁČEK"]
[6,"S105610015","Kultivátor 3 zubyXTR STALCO GARDEN","ks",6,224.25446947703895,224.25446947703895,1345.5268168622338,1345.5268168622338,null,"R10","R-90265","HÁČEK"]
[7,"S105610018","Motyčka s kultivátorem XTR STALCO GARDEN","ks",6,319.29167958998477,319.29167958998477,1915.7500775399085,1915.7500775399085,null,"R10","R-90265","HÁČEK"]
[8,"S105610200","Lopatka široká EXP STALCO GARDEN","ks",6,138.38751648025453,138.38751648025453,830.3250988815272,830.3250988815272,null,"R10","R-90265","HÁČEK"]
[9,"S105610203","Lopatka úzká EXP STALCO GARDEN","ks",6,129.21725936409308,129.21725936409308,775.30355618455849,775.30355618455849,null,"R10","R-90265","HÁČEK"]
[10,"S105610206","Vidle ruční EXP STALCO GARDEN","ks",6,166.73194756657171,166.73194756657171,1000.3916853994302,1000.3916853994302,null,"R10","R-90265","HÁČEK"]
[11,"S105610209","Hrábě ruční EXP STALCO GARDEN","ks",6,171.7339059935689,171.7339059935689,1030.4034359614134,1030.4034359614134,null,"R10","R-90265","HÁČEK"]
[12,"S105610212","Hrábě vějířové ruční EXP STALCO GARDEN","ks",6,205.91395524471605,205.91395524471605,1235.4837314682964,1235.4837314682964,null,"R10","R-90265","HÁČEK"]
[13,"S105610215","Kultivátor 3 zubyEXP STALCO GARDEN","ks",6,162.56364887740742,162.56364887740742,975.38189326444444,975.38189326444444,null,"R10","R-90265","HÁČEK"]
[14,"S105610218","Motyčka s kultivátorem EXP STALCO GARDEN","ks",6,192.57539943939034,192.57539943939034,1155.452396636342,1155.452396636342,null,"R10","R-90265","HÁČEK"]
[15,"S105610400","Lopatka široká plastová STR STALCO GARDEN","ks",10,42.242442680061103,42.242442680061103,422.42442680061106,422.42442680061106,null,"R10","R-90265","HÁČEK"]
[16,"S105610403","Lopatka úzká plastová STR STALCO GARDEN","ks",10,34.440874144048877,34.440874144048877,344.40874144048877,344.40874144048877,null,"R10","R-90265","HÁČEK"]
[17,"S105610406","Vidle ruční plastové STR STALCO GARDEN","ks",10,34.440874144048877,34.440874144048877,344.40874144048877,344.40874144048877,null,"R10","R-90265","HÁČEK"]
[18,"S105610415","Kultivátor 3 zuby plastový STR STALCO GARDEN","ks",10,55.505109191281875,55.505109191281875,555.05109191281872,555.05109191281872,null,"R10","R-90265","HÁČEK"]
[19,"S105610418","Motyka plastováSTR STALCO GARDEN","ks",10,35.221030997650097,35.221030997650097,352.21030997650098,352.21030997650098,null,"R10","R-90265","HÁČEK"]
[20,"S105610448","Podložka pod kolena STR STALCO GARDEN","ks",10,69.547932556103873,69.547932556103873,695.47932556103876,695.47932556103876,null,"R10","R-90265","HÁČEK"]
[21,"S106610203","Koš zahradnický skládací 80l EXP","ks",5,266.56628753323798,266.56628753323798,1332.8314376661899,1332.8314376661899,null,"R10.1","R-90355","KOŠ"]
[22,"S106610206","Koš zahradnický skládací 172l EXP","ks",5,359.420654146554,359.420654146554,1797.1032707327699,1797.1032707327699,null,"R10.1","R-90355","KOŠ"]
[23,"S106610003","Koš zahradnický skládací vyztužené dno 80l XTR","ks",3,413.19814336655395,413.19814336655395,1239.5944300996618,1239.5944300996618,null,"R10.1","R-90355","KOŠ"]
[24,"S106610006","Koš zahradnický skládací vyztužené dno 172l XTR","ks",3,566.84811256655394,566.84811256655394,1700.5443376996618,1700.5443376996618,null,"R10.1","R-90355","KOŠ"]
[null,null,"SUMA",null,160,null,null,{"$f":"SUM(H5:H28)","v":25620.648178602645},{"$f":"SUM(I5:I28)","v":25620.648178602645}]
[]
[]
[]
[]
[]
[]
[]
[]
[]
[]
[]
[null,null,"Specifikace regálových prvků",null,null,null,null,"rabat",0]
["Poz.","Kat. číslo","Popis","MJ","Množství","cena","Cena po odečtení rabatu","Celkem","Celkem po odečtení rabatu"]
[1,"R-90265","DVOJITÝ HÁČEK S CENOVKOU","ks",20,78.780479999999997,{"$f":"F43-(F43*$I$41)","v":78.780479999999997},{"$f":"F43*E43","v":1575.6096},{"$f":"H43-(H43*$I$41)","v":1575.6096}]
[2,"R-90355","KOŠ NA BHP","ks",1,1952.76396,{"$f":"F44-(F44*$I$41)","v":1952.76396},1952.76396,{"$f":"H44-(H44*$I$41)","v":1952.76396}]
[3,"R-90358","ROZDĚLOVNÍK DO KOŠE NA BHP","ks",3,223.11551999999998,223.11551999999998,669.34655999999995,669.34655999999995]
[4,"R-90305","CENOVÁ LIŠTA STŘÍBNRÁ 950mm BU","ks",1,26.30808,26.30808,26.30808,26.30808]
[5,"R-90315","CENOVÁ LIŠTA TRANSPARENTNÍ 65MM BU","ks",20,2.7314400000000001,2.7314400000000001,54.628799999999998,54.628799999999998]
[6,"R-91084","GRAFIKA LOGO STALCO DO CENOVÉ LIŠTY (POZADÍ POD CENOVKY) R-91084 BU","ks",1,27.170639999999999,27.170639999999999,27.170639999999999,27.170639999999999]
[7,"SZKIELET",null,"bal.",null,0,{"$f":"F49-(F49*$I$41)","v":0},0,{"$f":"H49-(H49*$I$41)","v":0}]
[null,null,"SUMA",null,46,null,null,{"$f":"SUM(H43:H49)","v":4305.8276400000004},{"$f":"SUM(I43:I49)","v":4305.8276400000004}]

{"sheet":"Regál 11","index":11,"n_rows":35,"n_cols":13,"rows_kept":35,"cut":false,"hidden":false,"merged":[[0,0,0,13]]}
["Regál 11"]
[]
[null,null,"Specifikace",null,null,null,null,"rabat",0,null,"Prvky regálu a umístění produktu"]
["Poz.","Kat. číslo","Popis","MJ","Množství","Kat. cena bez DPH","Cena po odečtení rabatu","Celkem","Celkem po odečtení rabatu","Obrázek","Místo na regálu","Kat. číslo","Cílová pozice"]
[1,"S105010600","Rýč rovný TRADITIONAL","ks",5,402.52799999999996,{"$f":"F5-(F5*$I$3)","v":402.52799999999996},{"$f":"F5*E5","v":2012.6399999999999},{"$f":"H5-(H5*$I$3)","v":2012.6399999999999},null,"R11","R-91817","SYSTÉMOVÁ HRAZDA"]
[2,"S105010603","Rýč špičatý TRADITIONAL","ks",5,402.52799999999996,{"$f":"F6-(F6*$I$3)","v":402.52799999999996},{"$f":"F6*E6","v":2012.6399999999999},{"$f":"H6-(H6*$I$3)","v":2012.6399999999999},null,"R11","R-91817","SYSTÉMOVÁ HRAZDA"]
[3,"S105010609","Lopata TRADITIONAL","ks",5,372.33839999999998,372.33839999999998,1861.692,1861.692,null,"R11","R-91823","SYSTÉMOVÁ HRAZDA"]
[4,"S105210606","Hrábě TRADITIONAL 12 zubů STALCO GARDEN","ks",5,327.05399999999997,327.05399999999997,1635.27,1635.27,null,"R11","R-90271","HÁČEK NA HRÁBĚ"]
[5,"S105210612","Hrábě TRADITIONAL 16 zubů STALCO GARDEN","ks",5,345.74279999999999,345.74279999999999,1728.7139999999999,1728.7139999999999,null,"R11","R-90271","HÁČEK NA HRÁBĚ"]
[6,"S105210651","Motyka TRADITIONAL 18cm","ks",5,291.83279999999996,291.83279999999996,1459.1639999999998,1459.1639999999998,null,"R11","R-90261","HÁČEK"]
[7,"S105210660","Kultivátor 3 hroty TRADITIONAL ","ks",5,291.83279999999996,291.83279999999996,1459.1639999999998,1459.1639999999998,null,"R11","R-90261","HÁČEK"]
[null,null,"SUMA",null,35,null,null,{"$f":"SUM(H5:H11)","v":12169.284},{"$f":"SUM(I5:I11)","v":12169.284}]
[]
[]
[]
[]
[]
[]
[]
[]
[]
[]
[]
[null,null,"Specifikace regálových prvků",null,null,null,null,"rabat",0]
["Poz.","Kat. číslo","Popis","MJ","Množství","cena","Cena po odečtení rabatu","Celkem","Celkem po odečtení rabatu"]
[1,"R-90261","JEDNODUCHÝ HÁČEK S CENOVKOU","ks",2,502.20658367999999,502.20658367999999,1004.41316736,1004.41316736]
[2,"R-90277","SYSTÉMOVÁ HRAZDA","ks",1,3039.0731740799997,3039.0731740799997,3039.0731740799997,3039.0731740799997]
[3,"R-90271","HÁK NA HRÁBĚ","ks",2,680.45892047999996,680.45892047999996,1360.9178409599999,1360.9178409599999]
[4,"R-91817","DRŽÁK NA HRAZDU S 5 PŮLKULATÝMI VÝŘEZY","ks",2,1500.41966976,1500.41966976,3000.8393395200001,3000.8393395200001]
[5,"R-91823","DRŽÁK NA HRAZDU S 5 HRANATÝMI VÝŘEZY","ks",1,1650.7716407999999,1650.7716407999999,1650.7716407999999,1650.7716407999999]
[6,"R-90305","CENOVÁ LIŠTA STŘÍBNRÁ 950mm BU","ks",1,189.10247903999999,189.10247903999999,189.10247903999999,189.10247903999999]
[7,"R-90315","CENOVÁ LIŠTA TRANSPARENTNÍ 65MM BU","ks",7,19.633590720000001,19.633590720000001,137.43513504000001,137.43513504000001]
[8,"R-91084","GRAFIKA LOGO STALCO DO CENOVÉ LIŠTY (POZADÍ POD CENOVKY) R-91084 BU","ks",1,195.30256032,195.30256032,195.30256032,195.30256032]
[9,"SZKIELET",null,"bal.",null,0,0,0,0]
[null,null,"SUMA",null,17,null,null,10577.85533712,10577.85533712]

{"sheet":"Regál 12","index":12,"n_rows":33,"n_cols":13,"rows_kept":33,"cut":false,"hidden":false,"merged":[[0,0,0,12]]}
["Regál 12"]
[]
[null,null,"Specifikace",null,null,null,null,"rabat",0,null,"Prvky regálu a umístění produktu"]
["Poz.","Kat. číslo","Popis","MJ","Množství","Kat. cena bez DPH","Cena po odečtení rabatu","Celkem","Celkem po odečtení rabatu","Obrázek","Místo na regálu","Kat. číslo","Cílová pozice"]
[1,"S105210312","Hrábě univer zubůální 12 zubů EXP STALCO GARDEN","ks",4,464.6897913450187,{"$f":"F5-(F5*$I$3)","v":464.6897913450187},{"$f":"F5*E5","v":1858.7591653800748},{"$f":"H5-(H5*$I$3)","v":1858.7591653800748},null,"R12","R-90261","HÁČEK"]
[2,"S105210315","Hrábě univer zubůální 18 zubů EXP STALCO GARDEN","ks",4,511.16260462377022,{"$f":"F6-(F6*$I$3)","v":511.16260462377022},{"$f":"F6*E6","v":2044.6504184950809},{"$f":"H6-(H6*$I$3)","v":2044.6504184950809},null,"R12","R-90261","HÁČEK"]
[3,"S105210330","Hrábě na listí 50 cm EXP STALCO GARDEN","ks",5,456.9487956335181,456.9487956335181,2284.7439781675903,2284.7439781675903,null,"R12","R-90271","HÁČEK"]
[4,"S105210500","Hrábě nastavitelné STR","ks",12,229.61726754939829,229.61726754939829,2755.4072105927794,2755.4072105927794,null,"R12","R-90261","2 X HÁČEK"]
[5,"S105210506","Hrábě nastavitelné hliníkové, teleskopické STR","ks",12,336.39402159500332,336.39402159500332,4036.7282591400399,4036.7282591400399,null,"R12","R-90261","3 X HÁČEK"]
[6,"S105210372","Vytrhávač plevele EXP","ks",5,877.58230506659993,877.58230506659993,4387.9115253330001,4387.9115253330001,null,"R12","R-90265","HÁČEK"]
[null,null,"SUMA",null,42,null,null,{"$f":"SUM(H5:H10)","v":17368.200557108565},{"$f":"SUM(I5:I10)","v":17368.200557108565}]
[]
[]
[]
[]
[]
[]
[]
[]
[]
[]
[]
[null,null,"Specifikace regálových prvků",null,null,null,null,"rabat",0]
["Poz.","Kat. číslo","Popis","MJ","Množství","cena","Cena po odečtení rabatu","Celkem","Celkem po odečtení rabatu"]
[1,"R-90261","JEDNODUCHÝ HÁČEK S CENOVKOU","ks",6,69.867360000000005,69.867360000000005,419.20416,419.20416]
[2,"R-90265","DVOJITÝ HÁČEK S CENOVKOU","ks",1,78.780479999999997,78.780479999999997,78.780479999999997,78.780479999999997]
[3,"R-90271","HÁK NA HRÁBĚ","ks",1,94.665959999999998,94.665959999999998,94.665959999999998,94.665959999999998]
[4,"R-90305","CENOVÁ LIŠTA STŘÍBNRÁ 950mm BU","ks",1,26.30808,26.30808,26.30808,26.30808]
[5,"R-90315","CENOVÁ LIŠTA TRANSPARENTNÍ 65MM BU","ks",6,2.7314400000000001,2.7314400000000001,16.388640000000002,16.388640000000002]
[6,"R-91084","GRAFIKA LOGO STALCO DO CENOVÉ LIŠTY (POZADÍ POD CENOVKY) R-91084 BU","ks",1,27.170639999999999,27.170639999999999,27.170639999999999,27.170639999999999]
[7,"R-90293","CENOVKA PRO SYSTÉMOVOU HRAZDU","ks",3,25.876799999999999,25.876799999999999,77.630399999999995,77.630399999999995]
[8,"SZKIELET",null,"bal.",null,0,0,0,0]
[null,null,"SUMA",null,19,null,null,740.14836000000014,740.14836000000014]

{"sheet":"Regál 13","index":13,"n_rows":34,"n_cols":13,"rows_kept":34,"cut":false,"hidden":false,"merged":[[0,0,0,12]]}
["Regál 13"]
[]
[null,null,"Specifikace",null,null,null,null,"rabat",0,null,"Prvky regálu a umístění produktu"]
["Poz.","Kat. číslo","Popis","MJ","Množství","Kat. cena bez DPH","Cena po odečtení rabatu","Celkem","Celkem po odečtení rabatu","Obrázek","Místo na regálu","Kat. číslo","Cílová pozice"]
[1,"S105210333","Hrábě na listí 60 cm EXP STALCO GARDEN","ks",5,484.35357820001917,{"$f":"F5-(F5*$I$3)","v":484.35357820001917},{"$f":"F5*E5","v":2421.7678910000959},{"$f":"H5-(H5*$I$3)","v":2421.7678910000959},null,"R13","R-90271","HÁČEK NA HRÁBĚ"]
[2,"S105210351","Koště 40cm EXP","ks",4,65.989895240615326,{"$f":"F6-(F6*$I$3)","v":65.989895240615326},{"$f":"F6*E6","v":263.9595809624613},{"$f":"H6-(H6*$I$3)","v":263.9595809624613},null,"R13","R-90261","HÁČEK"]
[3,"S105210354","Koště 65cm EXP","ks",4,78.363000598230713,78.363000598230713,313.45200239292285,313.45200239292285,null,"R13","R-90261","HÁČEK"]
[4,"S105010200","Rýč rovný EXP","ks",5,58.8,58.8,294,294,null,"R13","R-91817","SYSTZÉMOVÁ HRAZDA"]
[5,"S105010203","Rýč špičatý EXP","ks",5,58.8,58.8,294,294,null,"R13","R-91817","SYSTZÉMOVÁ HRAZDA"]
[6,"S105010209","Lopata EXP","ks",5,58.8,58.8,294,294,null,"R13","R-91817","SYSTZÉMOVÁ HRAZDA"]
[null,null,"SUMA",null,28,null,null,{"$f":"SUM(H5:H10)","v":3881.1794743554801},{"$f":"SUM(I5:I10)","v":3881.1794743554801}]
[]
[]
[]
[]
[]
[]
[]
[]
[]
[]
[]
[null,null,"Specifikace regálových prvků",null,null,null,null,"rabat",0]
["Poz.","Kat. číslo","Popis","MJ","Množství","cena","Cena po odečtení rabatu","Celkem","Celkem po odečtení rabatu"]
[1,"R-90261","JEDNODUCHÝ HÁČEK S CENOVKOU","ks",2,69.867360000000005,69.867360000000005,139.73472000000001,139.73472000000001]
[2,"R-90277","SYSTÉMOVÁ HRAZDA","ks",1,422.79816,422.79816,422.79816,422.79816]
[3,"R-90271","HÁK NA HRÁBĚ","ks",1,94.665959999999998,94.665959999999998,94.665959999999998,94.665959999999998]
[4,"R-91817","DRŽÁK NA HRAZDU S 5 PŮLKULATÝMI VÝŘEZY","ks",3,208.73952,208.73952,626.21856000000002,626.21856000000002]
[5,"R-90305","CENOVÁ LIŠTA STŘÍBNRÁ 950mm BU","ks",1,26.30808,26.30808,26.30808,26.30808]
[6,"R-90315","CENOVÁ LIŠTA TRANSPARENTNÍ 65MM BU","ks",6,2.7314400000000001,2.7314400000000001,16.388640000000002,16.388640000000002]
[7,"R-91084","GRAFIKA LOGO STALCO DO CENOVÉ LIŠTY (POZADÍ POD CENOVKY) R-91084 BU","ks",1,27.170639999999999,27.170639999999999,27.170639999999999,27.170639999999999]
[8,"R-90293","CENOVKA PRO SYSTÉMOVOU HRAZDU","ks",1,25.876799999999999,25.876799999999999,25.876799999999999,25.876799999999999]
[9,"SZKIELET",null,"bal.",null,0,0,0,0]
[null,null,"SUMA",null,16,null,null,1379.16156,1379.16156]

{"sheet":"Regál 14","index":14,"n_rows":35,"n_cols":13,"rows_kept":35,"cut":false,"hidden":false,"merged":[[0,0,0,12]]}
["Regal 14"]
[]
[null,null,"Specifikace",null,null,null,null,"rabat",0,null,"Prvky regálu a umístění produktu"]
["Poz.","Kat. číslo","Popis","MJ","Množství","Kat. cena bez DPH","Cena po odečtení rabatu","Celkem","Celkem po odečtení rabatu","Obrázek","Místo na regálu","Kat. číslo","Cílová pozice"]
[1,"S-74001","Lopata na písek","ks",4,751.3,{"$f":"F5-(F5*$I$3)","v":751.3},{"$f":"F5*E5","v":3005.2},{"$f":"H5-(H5*$I$3)","v":3005.2},null,"R14","R-91817","SYSTÉMOVÁ HRAZDA"]
[2,"S-74003","Rýč rovný","ks",8,726.5,{"$f":"F6-(F6*$I$3)","v":726.5},{"$f":"F6*E6","v":5812},{"$f":"H6-(H6*$I$3)","v":5812},null,"R14","R-91817","SYSTÉMOVÁ HRAZDA"]
[3,"S-74005","Rýč špičatý","ks",4,726.5,726.5,2906,2906,null,"R14","R-91817","SYSTÉMOVÁ HRAZDA"]
[4,"S-74007","Vidle rycí","ks",4,886.5,886.5,3546,3546,null,"R14","R-91817","SYSTÉMOVÁ HRAZDA"]
[5,"S-74009","Hrábě ERGO","ks",4,644.70000000000005,644.70000000000005,2578.8000000000002,2578.8000000000002,null,"R14","R-91817","SYSTÉMOVÁ HRAZDA"]
[6,"S-76317","Rukavice nylonové 8 \"NITRILE FLEX PVC DOTS\"","pár",12,111.6,111.6,1339.1999999999998,1339.1999999999998,null,"R14","R-90265","HÁČEK"]
[7,"S-76319","Rukavice nylonové 9 \"NITRILE FLEX PVC DOTS\"","pár",12,111.6,111.6,1339.1999999999998,1339.1999999999998,null,"R14","R-90265","HÁČEK"]
[8,"S-76321","Rukavice nylonové 10 \"NITRILE FLEX PVC DOTS\"","pár",12,111.6,111.6,1339.1999999999998,1339.1999999999998,null,"R14","R-90265","HÁČEK"]
[9,"S-76322","Rukavice nylonové 11 \"NITRILE FLEX PVC DOTS\"","pár",12,111.6,111.6,1339.1999999999998,1339.1999999999998,null,"R14","R-90265","HÁČEK"]
[null,null,"SUMA",null,72,null,null,{"$f":"SUM(H5:H13)","v":23204.800000000003},{"$f":"SUM(I5:I13)","v":23204.800000000003}]
[]
[]
[]
[]
[]
[]
[]
[]
[]
[]
[]
[null,null,"Specifikace regálových prvků",null,null,null,null,"rabat",0]
["Poz.","Kat. číslo","Popis","MJ","Množství","cena","Cena po odečtení rabatu","Celkem","Celkem po odečtení rabatu"]
[1,"R-90265","DVOJITÝ HÁČEK S CENOVKOU","ks",4,78.780479999999997,78.780479999999997,315.12191999999999,315.12191999999999]
[2,"R-90277","SYSTÉMOVÁ HRAZDA","ks",2,422.79816,422.79816,845.59631999999999,845.59631999999999]
[3,"R-91817","DRŽÁK NA HRAZDU S PŮLKULATÝMI VÝŘEZY","ks",6,208.73952,208.73952,1252.43712,1252.43712]
[4,"R-90305","CENOVÁ LIŠTA STŘÍBNRÁ 950mm BU","ks",1,26.30808,26.30808,26.30808,26.30808]
[5,"R-90315","CENOVÁ LIŠTA TRANSPARENTNÍ 65MM BU","ks",10,2.7314400000000001,2.7314400000000001,27.314399999999999,27.314399999999999]
[6,"R-91084","GRAFIKA LOGO STALCO DO CENOVÉ LIŠTY (POZADÍ POD CENOVKY) R-91084 BU","ks",1,27.170639999999999,27.170639999999999,27.170639999999999,27.170639999999999]
[7,"SZKIELET",null,"bal.",null,0,0,0,0]
[null,null,"SUMA",null,24,null,null,2493.9484799999996,2493.9484799999996]