{"text_format":"1","workbook":"xlsx","n_sheets":15,"sheets":["KONCEPT ZAHRADA 14X1M","Regál 1","Regál 2","Regál 3","Regál 4","Regál 5","Regál 6","Regál 7","Regál 8","Regál 9","Regál 10","Regál 11","Regál 12","Regál 13","Regál 14"],"not_rendered":{"charts":0,"images":229,"macros":1,"external_links":1,"defined_names":29,"comments":0,"pivot_tables":0},"unopened":[],"bounds":{"document_bytes":16777216,"sheet_cells":100000,"rows_first":2000,"rows_last":500,"rows_between":2000,"halvings":0,"cell_chars":16384,"cell_head_chars":4096},"cells_cut":0,"cells_raw":0,"read":"whole","date_system":"1900"}

{"sheet":"KONCEPT ZAHRADA 14X1M","index":0,"n_rows":310,"n_cols":13,"rows_kept":310,"cut":false,"hidden":false,"merged":[[0,0,0,12]]}
["ZAHRADA 14 X 1M"]
[]
[null,null,"Specifikace",null,null,null,null,"rabat",0,null,"Prvky regálu a umístění produktu"]
["Poz.","Kat. číslo","Popis","MJ","Množství","Kat. cena\nks/bez DPH","Vaše nákupní cena","Celkem","Celkem po odečtení rabatu","Obrázek","Místo na regálu","Kat. číslo","Cílová pozici"]
[1,"S102081215","Hadice zahradní 1/2\" 15m STR STALCO GARDEN",{"$f":"VLOOKUP(B5,'[1]CENÍK 2023_01'!$C:$L,10,0)","v":"ks"},3,{"$f":"VLOOKUP(B5,'[1]CENÍK 2023_01'!$C:$P,14,0)","v":226.37024640000001},{"$f":"F5-(F5*$I$3)","v":226.37024640000001},{"$f":"F5*E5","v":679.11073920000001},{"$f":"H5-(H5*$I$3)","v":679.11073920000001},null,"R1.1","R-92625","POLICE"]
[2,"S102081220","Hadice zahradní 1/2\" 20m STR STALCO GARDEN",{"$f":"VLOOKUP(B6,'[1]CENÍK 2023_01'!$C:$L,10,0)","v":"ks"},3,{"$f":"VLOOKUP(B6,'[1]CENÍK 2023_01'!$C:$P,14,0)","v":301.82699520000006},301.82699520000006,{"$f":"F6*E6","v":905.48098560000017},{"$f":"H6-(H6*$I$3)","v":905.48098560000017},null,"R1.1","R-92625","POLICE"]
[3,"S102081230","Hadice zahradní 1/2\" 30m STR STALCO GARDEN",{"$f":"VLOOKUP(B7,'[1]CENÍK 2023_01'!$C:$L,10,0)","v":"ks"},3,{"$f":"VLOOKUP(B7,'[1]CENÍK 2023_01'!$C:$P,14,0)","v":452.74049280000003},{"$f":"F7-(F7*$I$3)","v":452.74049280000003},{"$f":"F7*E7","v":1358.2214784},{"$f":"H7-(H7*$I$3)","v":1358.2214784},null,"R1.1","R-92625","POLICE"]
[4,"S102081250","Hadice zahradní 1/2\" 50m STR STALCO GARDEN",{"$f":"VLOOKUP(B8,'[1]CENÍK 2023_01'!$C:$L,10,0)","v":"ks"},2,{"$f":"VLOOKUP(B8,'[1]CENÍK 2023_01'!$C:$P,14,0)","v":754.56748800000003},754.56748800000003,{"$f":"F8*E8","v":1509.1349760000001},{"$f":"H8-(H8*$I$3)","v":1509.1349760000001},null,"R1.2","R-92625","POLICE"]
[5,"S102083420","Hadice zahradní 3/4\" 20m STR STALCO GARDEN",{"$f":"VLOOKUP(B9,'[1]CENÍK 2023_01'!$C:$L,10,0)","v":"ks"},3,{"$f":"VLOOKUP(B9,'[1]CENÍK 2023_01'!$C:$P,14,0)","v":558.93888000000004},558.93888000000004,1676.81664,1676.81664,null,"R1.3","R-92625","POLICE"]
[6,"S102083430","Hadice zahradní 3/4\" 30m STR STALCO GARDEN",{"$f":"VLOOKUP(B10,'[1]CENÍK 2023_01'!$C:$L,10,0)","v":"ks"},3,{"$f":"VLOOKUP(B10,'[1]CENÍK 2023_01'!$C:$P,14,0)","v":838.40832000000012},838.40832000000012,2515.2249600000005,2515.2249600000005,null,"R1.3","R-92625","POLICE"]
{"$rows_left_out":301}
{"sheet":"Regál 1","index":1,"n_rows":40,"n_cols":13,"rows_kept":40,"cut":false,"hidden":false,"merged":[[0,0,0,12]]}
["Regál 1"]
[]
[null,null,"Specifikace",null,null,null,null,"rabat",0,null,"Prvky regálu a umístění produktu"]
["Poz.","Kat. číslo","Popis","jm","Množství","Kat. cena bez DPH","Cena po odečtení rabatu","Celkem","Celkem po odečtení rabatu","Obrázek","Místo na regálu","Kat. číslo","Cílová pozice"]
[1,"S102081215","Hadice zahradní 1/2\" 15m STR STALCO GARDEN","ks",3,226.37024640000001,{"$f":"F5-(F5*$I$3)","v":226.37024640000001},{"$f":"F5*E5","v":679.11073920000001},{"$f":"H5-(H5*$I$3)","v":679.11073920000001},null,"R1.1","R-92625","POLICE"]
[2,"S102081220","Hadice zahradní 1/2\" 20m STR STALCO GARDEN","ks",3,301.82699520000006,{"$f":"F6-(F6*$I$3)","v":301.82699520000006},{"$f":"F6*E6","v":905.48098560000017},{"$f":"H6-(H6*$I$3)","v":905.48098560000017},null,"R1.1","R-92625","POLICE"]
[3,"S102081230","Hadice zahradní 1/2\" 30m STR STALCO GARDEN","ks",3,452.74049280000003,452.74049280000003,{"$f":"F7*E7","v":1358.2214784},1358.2214784,null,"R1.1","R-92625","POLICE"]
[4,"S102081250","Hadice zahradní 1/2\" 50m STR STALCO GARDEN","ks",2,754.56748800000003,754.56748800000003,1509.1349760000001,1509.1349760000001,null,"R1.2","R-92625","POLICE"]
[5,"S102083420","Hadice zahradní 3/4\" 20m STR STALCO GARDEN","ks",3,558.93888000000004,558.93888000000004,1676.81664,1676.81664,null,"R1.3","R-92625","POLICE"]
[6,"S102083430","Hadice zahradní 3/4\" 30m STR STALCO GARDEN","ks",3,838.40832000000012,838.40832000000012,2515.2249600000005,2515.2249600000005,null,"R1.3","R-92625","POLICE"]
{"$rows_left_out":31}
{"sheet":"Regál 2","index":2,"n_rows":37,"n_cols":13,"rows_kept":37,"cut":false,"hidden":false,"merged":[[0,0,0,12],[2,10,2,12]]}
["Regál 2"]
[]
[null,null,"Specifikace",null,null,null,null,"rabat",0,null,"Prvky regálu a umístění produktu"]
["Poz.","Kat. číslo","Popis","MJ","Množství","Kat. cena bez DPH","Cena po odečtení rabatu","Celkem","Celkem po odečtení rabatu","Obrázek","Místo na regálu","Kat. číslo","Cílová pozice"]
[1,"S102041220","Hadice zahradní ATS 1/2\" 20m EXP STALCO GARDEN","ks",3,566.39139839999996,{"$f":"F5-(F5*$I$3)","v":566.39139839999996},{"$f":"F5*E5","v":1699.1741951999998},{"$f":"H5-(H5*$I$3)","v":1699.1741951999998},null,"R2.1","R-92625","PÓŁKA"]
[2,"S102041230","Hadice zahradní ATS 1/2\" 30m EXP STALCO GARDEN","ks",3,849.58709759999999,{"$f":"F6-(F6*$I$3)","v":849.58709759999999},{"$f":"F6*E6","v":2548.7612927999999},{"$f":"H6-(H6*$I$3)","v":2548.7612927999999},null,"R2.1","R-92625","PÓŁKA"]
[3,"S102041250","Hadice zahradní ATS 1/2\" 50m EXP STALCO GARDEN","ks",3,1415.9784960000002,1415.9784960000002,4247.935488000001,4247.935488000001,null,"R.1.3","R-92625","PÓŁKA"]
[4,"S102043420","Hadice zahradní ATS 3/4\" 20m EXP STALCO GARDEN","ks",3,894.30220799999995,894.30220799999995,2682.9066239999997,2682.9066239999997,null,"R2.1","R-92625","PÓŁKA"]
[5,"S102043430","Hadice zahradní ATS 3/4\" 30m EXP STALCO GARDEN","ks",2,1341.4533119999999,1341.4533119999999,2682.9066239999997,2682.9066239999997,null,"R2",null,"PODEST"]
[6,"S102043450","Hadice zahradní ATS 3/4\" 50m EXP STALCO GARDEN","ks",2,2235.7555200000002,2235.7555200000002,4471.5110400000003,4471.5110400000003,null,"R2",null,"PODEST"]
{"$rows_left_out":28}
{"sheet":"Regál 3","index":3,"n_rows":67,"n_cols":13,"rows_kept":67,"cut":false,"hidden":false,"merged":[[0,0,0,12]]}
["Regál 3"]
[]
[null,null,"Specifikace",null,null,null,null,"rabat",0,null,"Prvky regálu a umístění produktu"]
["Poz.","Kat. číslo","Popis","MJ","Množství","Kat. cena bez DPH","Cena po odečtení rabatu","Celkem","Celkem po odečtení rabatu","Obrázek","Místo na regálu","Kat. číslo","Cílová pozice"]
[1,"S101010400","Rychlospojka průchozí 1/2\" STR STALCO GARDEN","ks",30,18.358993698847666,{"$f":"F5-(F5*$I$3)","v":18.358993698847666},{"$f":"F5*E5","v":550.76981096543},{"$f":"H5-(H5*$I$3)","v":550.76981096543},null,"R3.1","R-92625","POLICE"]
[2,"S101010403","Rychlospojka s funkcí stop 1/2\" STR STALCO GARDEN","ks",30,20.710089773867136,{"$f":"F6-(F6*$I$3)","v":20.710089773867136},{"$f":"F6*E6","v":621.30269321601406},{"$f":"H6-(H6*$I$3)","v":621.30269321601406},null,"R3.1","R-92625","POLICE"]
[3,"S101010406","Rychlospojka průchozí 3/4\" STR STALCO GARDEN","ks",30,22.754521143449278,22.754521143449278,682.63563430347835,682.63563430347835,null,"R3.1","R-92625","POLICE"]
[4,"S101010409","Rychlospojka s funkcí stop 3/4\" STR STALCO GARDEN","ks",30,24.79895251303142,24.79895251303142,743.96857539094265,743.96857539094265,null,"R3.1","R-92625","POLICE"]
[5,"S101010430","Spojka hadicová opravná 1/2\" STR STALCO GARDEN","ks",30,14.576795665120695,14.576795665120695,437.30386995362085,437.30386995362085,null,"R3.1","R-92625","POLICE"]
[6,"S101010433","Spojka hadicová opravná 3/4\" STR STALCO GARDEN","ks",30,18.665658404284986,18.665658404284986,559.96975212854954,559.96975212854954,null,"R3.1","R-92625","POLICE"]
{"$rows_left_out":58}
{"sheet":"Regál 4","index":4,"n_rows":63,"n_cols":13,"rows_kept":63,"cut":false,"hidden":false,"merged":[[0,0,0,12]]}
["Regál 4"]
[]
[null,null,"Specifikace",null,null,null,null,"rabat",0,null,"Prvky regálu a umístění produktu"]
["Poz.","Kat. číslo","Popis","MJ","Množství","Kat. cena bez DPH","Cena po odečtení rabatu","Celkem","Celkem po odečtení rabatu","Obrázek","Místo na regálu","Kat. číslo","Cílová pozice"]
[1,"S101010200","Rychlospojka průchozí 1/2\" EXP STALCO GARDEN","ks",6,46.721525475148567,{"$f":"F5-(F5*$I$3)","v":46.721525475148567},{"$f":"F5*E5","v":280.32915285089143},{"$f":"H5-(H5*$I$3)","v":280.32915285089143},null,"R4","R-90265","HÁČEK"]
[2,"S101010203","Rychlospojka s funkcí stop 1/2\" EXP STALCO GARDEN","ks",6,50.535527554752541,{"$f":"F6-(F6*$I$3)","v":50.535527554752541},{"$f":"F6*E6","v":303.21316532851523},{"$f":"H6-(H6*$I$3)","v":303.21316532851523},null,"R4","R-90265","HÁČEK"]
[3,"S101010206","Rychlospojka průchozí 3/4\" EXP STALCO GARDEN","ks",6,49.582027034851556,49.582027034851556,297.49216220910932,297.49216220910932,null,"R4","R-90265","HÁČEK"]
[4,"S101010209","Rychlospojka s funkcí stop 3/4\" EXP STALCO GARDEN","ks",6,53.396029114455516,53.396029114455516,320.37617468673307,320.37617468673307,null,"R4","R-90265","HÁČEK"]
[5,"S101010212","Rychlospojka s ventilem 1/2\" EXP STALCO GARDEN","ks",6,67.698536912970383,67.698536912970383,406.1912214778223,406.1912214778223,null,"R4","R-90265","HÁČEK"]
[6,"S101010215","Rychlospojka s ventilem 3/4\" EXP STALCO GARDEN","ks",6,69.605537952772366,69.605537952772366,417.63322771663422,417.63322771663422,null,"R4","R-90265","HÁČEK"]
{"$rows_left_out":54}
{"sheet":"Regál 5","index":5,"n_rows":58,"n_cols":13,"rows_kept":58,"cut":false,"hidden":false,"merged":[[0,0,0,12]]}
["Regál 5"]
[]
[null,null,"Specifikace",null,null,null,null,"rabat",0,null,"Prvky regálu a umístění produktu"]
["Poz.","Kat. číslo","Popis","MJ","Množství","Kat. cena bez DPH","Cena po odečtení rabatu","Celkem","Celkem po odečtení rabatu","Obrázek","Místo na regálu","Kat. číslo","Cílová pozice"]
[1,"S101010000","Rychlospojka průchozí 1/2\" XTR STALCO GARDEN","ks",6,84.406799869389289,{"$f":"F5-(F5*$I$3)","v":84.406799869389289},{"$f":"F5*E5","v":506.44079921633573},{"$f":"H5-(H5*$I$3)","v":506.44079921633573},null,"R5","R-90265","HÁČEK"]
[2,"S101010003","Rychlospojka s funkcí stop 1/2\" XTR STALCO GARDEN","ks",6,88.103448038851582,{"$f":"F6-(F6*$I$3)","v":88.103448038851582},{"$f":"F6*E6","v":528.62068823310949},{"$f":"H6-(H6*$I$3)","v":528.62068823310949},null,"R5","R-90265","HÁČEK"]
[3,"S101010006","Rychlospojka průchozí 3/4\" XTR STALCO GARDEN","ks",6,102.80202528409455,102.80202528409455,616.81215170456733,616.81215170456733,null,"R5","R-90265","HÁČEK"]
[4,"S101010009","Rychlospojka s funkcí stop 3/4\" XTR STALCO GARDEN","ks",6,106.41065802095063,106.41065802095063,638.46394812570384,638.46394812570384,null,"R5","R-90265","HÁČEK"]
[5,"S101010012","Rychlospojka s ventilem 1/2\" XTR STALCO GARDEN","ks",6,101.83385552542588,101.83385552542588,611.00313315255528,611.00313315255528,null,"R5","R-90265","HÁČEK"]
[6,"S101010015","Rychlospojka s ventilem 3/4\" XTR STALCO GARDEN","ks",6,116.53243277066885,116.53243277066885,699.19459662401312,699.19459662401312,null,"R5","R-90265","HÁČEK"]
{"$rows_left_out":49}
{"sheet":"Regál 6","index":6,"n_rows":61,"n_cols":13,"rows_kept":61,"cut":false,"hidden":false,"merged":[[0,1,0,12]]}
[null,"Regál 6"]
[]
[null,null,"Specifikace",null,null,null,null,"rabat",0,null,"Prvky regálu a umístění produktu"]
["Poz.","Kat. číslo","Popis","MJ","Množství","Kat. cena bez DPH","Cena po odečtení rabatu","Celkem","Celkem po odečtení rabatu","Obrázek","Místo na regálu","Kat. číslo","Cílová pozice"]
[1,"S101010600","Rychlospojka průchozí 1/2\" BRS STALCO GARDEN","ks",6,105.63912114325859,{"$f":"F5-(F5*$I$3)","v":105.63912114325859},{"$f":"F5*E5","v":633.83472685955155},{"$f":"H5-(H5*$I$3)","v":633.83472685955155},null,"R6","R-90265","HÁČEK"]
[2,"S101010603","Rychlospojka s funkcí stop 1/2\" BRS STALCO GARDEN","ks",6,105.09104530066222,{"$f":"F6-(F6*$I$3)","v":105.09104530066222},{"$f":"F6*E6","v":630.54627180397324},{"$f":"H6-(H6*$I$3)","v":630.54627180397324},null,"R6","R-90265","HÁČEK"]
[3,"S101010606","Rychlospojka průchozí 3/4\" BRS STALCO GARDEN","ks",6,136.52995711667666,136.52995711667666,819.17974270005993,819.17974270005993,null,"R6","R-90265","HÁČEK"]
[4,"S101010609","Rychlospojka s funkcí stop 3/4\" BRS STALCO GARDEN","ks",6,127.69354147588004,127.69354147588004,766.16124885528029,766.16124885528029,null,"R6","R-90265","HÁČEK"]
[5,"S101010630","Spojka hadicová opravná 1/2\" BRS STALCO GARDEN","ks",6,103.36325945962338,103.36325945962338,620.17955675774033,620.17955675774033,null,"R6","R-90265","HÁČEK"]
[6,"S101010633","Spojka hadicová opravná 3/4\" BRS STALCO GARDEN","ks",6,176.29230487598483,176.29230487598483,1057.7538292559088,1057.7538292559088,null,"R6","R-90265","HÁČEK"]
{"$rows_left_out":52}
{"sheet":"Regál 7","index":7,"n_rows":43,"n_cols":18,"rows_kept":43,"cut":false,"hidden":false,"merged":[[0,1,0,12]]}
[null,"Regál 7"]
[]
[null,null,"Specifikace",null,null,null,null,"rabat",0,null,"Prvky regálu a umístění produktu"]
["Poz.","Kat. číslo","Popis","MJ","Množství","Kat. cena bez DPH","Cena po odečtení rabatu","Celkem","Celkem po odečtení rabatu","Obrázek","Místo na regálu","Kat. číslo","Cílová pozice",null,null,null,null,"Z:\\ZDJĘCIA KATALOG STALCO - MINIATURY EAN\\"]
[1,"S103210406","Postřikovač tlakový ruční 1,5l STR STALCO GARDEN","ks",4,106.02780283103651,{"$f":"F5-(F5*$I$3)","v":106.02780283103651},{"$f":"F5*E5","v":424.11121132414604},{"$f":"H5-(H5*$I$3)","v":424.11121132414604},null,"R7.1","R-92625","POLICE"]
[2,"S103210409","Postřikovač tlakový ruční 2l STR STALCO GARDEN","ks",4,114.57843209160397,{"$f":"F6-(F6*$I$3)","v":114.57843209160397},{"$f":"F6*E6","v":458.31372836641589},{"$f":"H6-(H6*$I$3)","v":458.31372836641589},null,"R7.1","R-92625","POLICE"]
[3,"S103210415","Postřikovač tlakový 5l STR STALCO GARDEN","ks",4,392.47388306004643,392.47388306004643,1569.8955322401857,1569.8955322401857,null,"R7.3","R-92625","POLICE"]
[4,"S103210418","Postřikovač tlakový 8l STR STALCO GARDEN","ks",4,435.22702936288374,435.22702936288374,1740.908117451535,1740.908117451535,null,"R7","R-92625","PODESTA"]
[5,"S103210206","Postřikovač tlakový ruční 1,5l EXP STALCO GARDEN","ks",4,235.99736759166191,235.99736759166191,943.98947036664765,943.98947036664765,null,"R7.1","R-92625","POLICE"]
[6,"S103210209","Postřikovač tlakový ruční 2l EXP STALCO GARDEN","ks",4,253.09862611279686,253.09862611279686,1012.3945044511875,1012.3945044511875,null,"R7.1","R-92625","POLICE"]
{"$rows_left_out":34}
{"sheet":"Regál 8","index":8,"n_rows":37,"n_cols":13,"rows_kept":37,"cut":false,"hidden":false,"merged":[[0,0,0,12]]}
["Regál 8"]
[]
[null,null,"Specifikace",null,null,null,null,"rabat",0,null,"Prvky regálu a umístění produktu"]
["Poz.","Kat. číslo","Popis","MJ","Množství","Kat. cena bez DPH","Cena po odečtení rabatu","Celkem","Celkem po odečtení rabatu","Obrázek","Místo na regálu","Kat. číslo","Cílová pozice"]
[1,"S104010406","Nůžky zahradnické STR STALCO GARDEN","ks",10,235.59661943999996,{"$f":"F5-(F5*$I$3)","v":235.59661943999996},{"$f":"F5*E5","v":2355.9661943999995},{"$f":"H5-(H5*$I$3)","v":2355.9661943999995},null,"R8","R-90265","HÁČEK"]
[2,"S104010412","Nůžky zahradnické STR STALCO GARDEN","ks",12,235.59661943999996,{"$f":"F6-(F6*$I$3)","v":235.59661943999996},{"$f":"F6*E6","v":2827.1594332799996},{"$f":"H6-(H6*$I$3)","v":2827.1594332799996},null,"R8","R-90265","HÁČEK"]
[3,"S104010415","Nůžky zahradnické kovadlinové STR STALCO GARDEN","ks",12,240.12732365999997,240.12732365999997,2881.5278839199996,2881.5278839199996,null,"R8","R-90265","HÁČEK"]
[4,"S104010421","Nůžky zahradnické STR STALCO GARDEN","ks",10,253.71943631999994,253.71943631999994,2537.1943631999993,2537.1943631999993,null,"R8","R-90265","HÁČEK"]
[5,"S104010424","Nůžky zahradnické kovadlinové STR STALCO GARDEN","ks",10,258.25014053999996,258.25014053999996,2582.5014053999994,2582.5014053999994,null,"R8","R-90265","HÁČEK"]
[6,"S104020406","Nůžky na větve 790mm STR STALCO GARDEN","ks",4,362.45633759999993,362.45633759999993,1449.8253503999997,1449.8253503999997,null,"R8","R-90265","HÁČEK"]
{"$rows_left_out":28}
{"sheet":"Regál 9","index":9,"n_rows":46,"n_cols":13,"rows_kept":46,"cut":false,"hidden":false,"merged":[[0,0,0,12]]}
["Regál 9"]
[]
[null,null,"Specifikace",null,null,null,null,"rabat",0,null,"Prvky regálu a umístění produktu"]
["Poz.","Kat. číslo","Popis","MJ","Množství","Kat. cena bez DPH","Cena po odečtení rabatu","Celkem","Celkem po odečtení rabatu","Obrázek","Místo na regálu","Kat. číslo","Cílová pozice"]
[1,"S104070212","Pilka zahradní skládací 230mm EXP STALCO GARDEN","ks",6,308.08788695999993,{"$f":"F5-(F5*$I$3)","v":308.08788695999993},{"$f":"F5*E5","v":1848.5273217599997},{"$f":"H5-(H5*$I$3)","v":1848.5273217599997},null,"R9","R-90265","HÁČEK"]
[2,"S104070221","Pilka zahradní 270mm EXP STALCO GARDEN","ks",6,308.08788695999993,{"$f":"F6-(F6*$I$3)","v":308.08788695999993},{"$f":"F6*E6","v":1848.5273217599997},{"$f":"H6-(H6*$I$3)","v":1848.5273217599997},null,"R9","R-90265","HÁČEK"]
[3,"S104070257","Pila oblouková 533mm EXP STALCO GARDEN","ks",5,208.41239411999993,208.41239411999993,1042.0619705999998,1042.0619705999998,null,"R9","R-98020","HÁČEK NA PILY"]
[4,"S104070260","Pila oblouková 610mm EXP STALCO GARDEN","ks",5,217.47380255999997,217.47380255999997,1087.3690127999998,1087.3690127999998,null,"R9","R-98020","HÁČEK NA PILY"]
[5,"S104097257","Pilový list do obloukové pily 533mm EXP na mokré dřevo STALCO GARDEN","ks",10,50.743887263999994,50.743887263999994,507.43887263999994,507.43887263999994,null,"R9","R-90261","HÁČEK"]
[6,"S104097258","Pilový list do obloukové pily 533mm EXP na suché dřevoSTALCO GARDEN","ks",10,57.993014015999989,57.993014015999989,579.93014015999984,579.93014015999984,null,"R9","R-90261","HÁČEK"]
{"$rows_left_out":37}
{"sheet":"Regál 10","index":10,"n_rows":50,"n_cols":13,"rows_kept":50,"cut":false,"hidden":false,"merged":[[0,0,0,12]]}
["Regál 10"]
[]
[null,null,"Specifikace",null,null,null,null,"rabat",0,null,"Prvky regálu a umístění produktu"]
["Poz.","Kat. číslo","Popis","MJ","Množství","Kat. cena bez DPH","Cena po odečtení rabatu","Celkem","Celkem po odečtení rabatu","Obrázek","Místo na regálu","Kat. číslo","Cílová pozice"]
[1,"S105610000","Lopatka široká XTR STALCO GARDEN","ks",6,193.40905917722318,{"$f":"F5-(F5*$I$3)","v":193.40905917722318},{"$f":"F5*E5","v":1160.4543550633391},{"$f":"H5-(H5*$I$3)","v":1160.4543550633391},null,"R10","R-90265","HÁČEK"]
[2,"S105610003","Lopatka úzká XTR STALCO GARDE","ks",6,183.40514232322886,{"$f":"F6-(F6*$I$3)","v":183.40514232322886},{"$f":"F6*E6","v":1100.4308539393733},{"$f":"H6-(H6*$I$3)","v":1100.4308539393733},null,"R10","R-90265","HÁČEK"]
[3,"S105610006","Vidle ruční XTR STALCO GARDEN","ks",6,229.25642790403612,229.25642790403612,1375.5385674242166,1375.5385674242166,null,"R10","R-90265","HÁČEK"]
[4,"S105610009","Hrábě ruční XTR STALCO GARDEN","ks",6,267.60477584434756,267.60477584434756,1605.6286550660852,1605.6286550660852,null,"R10","R-90265","HÁČEK"]
[5,"S105610012","Hrábě vějířové ruční XTR STALCO GARDEN","ks",6,221.75349026354039,221.75349026354039,1330.5209415812424,1330.5209415812424,null,"R10","R-90265","HÁČEK"]
[6,"S105610015","Kultivátor 3 zubyXTR STALCO GARDEN","ks",6,224.25446947703895,224.25446947703895,1345.5268168622338,1345.5268168622338,null,"R10","R-90265","HÁČEK"]
{"$rows_left_out":41}
{"sheet":"Regál 11","index":11,"n_rows":35,"n_cols":13,"rows_kept":35,"cut":false,"hidden":false,"merged":[[0,0,0,13]]}
["Regál 11"]
[]
[null,null,"Specifikace",null,null,null,null,"rabat",0,null,"Prvky regálu a umístění produktu"]
["Poz.","Kat. číslo","Popis","MJ","Množství","Kat. cena bez DPH","Cena po odečtení rabatu","Celkem","Celkem po odečtení rabatu","Obrázek","Místo na regálu","Kat. číslo","Cílová pozice"]
[1,"S105010600","Rýč rovný TRADITIONAL","ks",5,402.52799999999996,{"$f":"F5-(F5*$I$3)","v":402.52799999999996},{"$f":"F5*E5","v":2012.6399999999999},{"$f":"H5-(H5*$I$3)","v":2012.6399999999999},null,"R11","R-91817","SYSTÉMOVÁ HRAZDA"]
[2,"S105010603","Rýč špičatý TRADITIONAL","ks",5,402.52799999999996,{"$f":"F6-(F6*$I$3)","v":402.52799999999996},{"$f":"F6*E6","v":2012.6399999999999},{"$f":"H6-(H6*$I$3)","v":2012.6399999999999},null,"R11","R-91817","SYSTÉMOVÁ HRAZDA"]
[3,"S105010609","Lopata TRADITIONAL","ks",5,372.33839999999998,372.33839999999998,1861.692,1861.692,null,"R11","R-91823","SYSTÉMOVÁ HRAZDA"]
[4,"S105210606","Hrábě TRADITIONAL 12 zubů STALCO GARDEN","ks",5,327.05399999999997,327.05399999999997,1635.27,1635.27,null,"R11","R-90271","HÁČEK NA HRÁBĚ"]
[5,"S105210612","Hrábě TRADITIONAL 16 zubů STALCO GARDEN","ks",5,345.74279999999999,345.74279999999999,1728.7139999999999,1728.7139999999999,null,"R11","R-90271","HÁČEK NA HRÁBĚ"]
[6,"S105210651","Motyka TRADITIONAL 18cm","ks",5,291.83279999999996,291.83279999999996,1459.1639999999998,1459.1639999999998,null,"R11","R-90261","HÁČEK"]
{"$rows_left_out":26}
{"sheet":"Regál 12","index":12,"n_rows":33,"n_cols":13,"rows_kept":33,"cut":false,"hidden":false,"merged":[[0,0,0,12]]}
["Regál 12"]
[]
[null,null,"Specifikace",null,null,null,null,"rabat",0,null,"Prvky regálu a umístění produktu"]
["Poz.","Kat. číslo","Popis","MJ","Množství","Kat. cena bez DPH","Cena po odečtení rabatu","Celkem","Celkem po odečtení rabatu","Obrázek","Místo na regálu","Kat. číslo","Cílová pozice"]
[1,"S105210312","Hrábě univer zubůální 12 zubů EXP STALCO GARDEN","ks",4,464.6897913450187,{"$f":"F5-(F5*$I$3)","v":464.6897913450187},{"$f":"F5*E5","v":1858.7591653800748},{"$f":"H5-(H5*$I$3)","v":1858.7591653800748},null,"R12","R-90261","HÁČEK"]
[2,"S105210315","Hrábě univer zubůální 18 zubů EXP STALCO GARDEN","ks",4,511.16260462377022,{"$f":"F6-(F6*$I$3)","v":511.16260462377022},{"$f":"F6*E6","v":2044.6504184950809},{"$f":"H6-(H6*$I$3)","v":2044.6504184950809},null,"R12","R-90261","HÁČEK"]
[3,"S105210330","Hrábě na listí 50 cm EXP STALCO GARDEN","ks",5,456.9487956335181,456.9487956335181,2284.7439781675903,2284.7439781675903,null,"R12","R-90271","HÁČEK"]
[4,"S105210500","Hrábě nastavitelné STR","ks",12,229.61726754939829,229.61726754939829,2755.4072105927794,2755.4072105927794,null,"R12","R-90261","2 X HÁČEK"]
[5,"S105210506","Hrábě nastavitelné hliníkové, teleskopické STR","ks",12,336.39402159500332,336.39402159500332,4036.7282591400399,4036.7282591400399,null,"R12","R-90261","3 X HÁČEK"]
[6,"S105210372","Vytrhávač plevele EXP","ks",5,877.58230506659993,877.58230506659993,4387.9115253330001,4387.9115253330001,null,"R12","R-90265","HÁČEK"]
{"$rows_left_out":24}
{"sheet":"Regál 13","index":13,"n_rows":34,"n_cols":13,"rows_kept":34,"cut":false,"hidden":false,"merged":[[0,0,0,12]]}
["Regál 13"]
[]
[null,null,"Specifikace",null,null,null,null,"rabat",0,null,"Prvky regálu a umístění produktu"]
["Poz.","Kat. číslo","Popis","MJ","Množství","Kat. cena bez DPH","Cena po odečtení rabatu","Celkem","Celkem po odečtení rabatu","Obrázek","Místo na regálu","Kat. číslo","Cílová pozice"]
[1,"S105210333","Hrábě na listí 60 cm EXP STALCO GARDEN","ks",5,484.35357820001917,{"$f":"F5-(F5*$I$3)","v":484.35357820001917},{"$f":"F5*E5","v":2421.7678910000959},{"$f":"H5-(H5*$I$3)","v":2421.7678910000959},null,"R13","R-90271","HÁČEK NA HRÁBĚ"]
[2,"S105210351","Koště 40cm EXP","ks",4,65.989895240615326,{"$f":"F6-(F6*$I$3)","v":65.989895240615326},{"$f":"F6*E6","v":263.9595809624613},{"$f":"H6-(H6*$I$3)","v":263.9595809624613},null,"R13","R-90261","HÁČEK"]
[3,"S105210354","Koště 65cm EXP","ks",4,78.363000598230713,78.363000598230713,313.45200239292285,313.45200239292285,null,"R13","R-90261","HÁČEK"]
[4,"S105010200","Rýč rovný EXP","ks",5,58.8,58.8,294,294,null,"R13","R-91817","SYSTZÉMOVÁ HRAZDA"]
[5,"S105010203","Rýč špičatý EXP","ks",5,58.8,58.8,294,294,null,"R13","R-91817","SYSTZÉMOVÁ HRAZDA"]
[6,"S105010209","Lopata EXP","ks",5,58.8,58.8,294,294,null,"R13","R-91817","SYSTZÉMOVÁ HRAZDA"]
{"$rows_left_out":25}
{"sheet":"Regál 14","index":14,"n_rows":35,"n_cols":13,"rows_kept":35,"cut":false,"hidden":false,"merged":[[0,0,0,12]]}
["Regal 14"]
[]
[null,null,"Specifikace",null,null,null,null,"rabat",0,null,"Prvky regálu a umístění produktu"]
["Poz.","Kat. číslo","Popis","MJ","Množství","Kat. cena bez DPH","Cena po odečtení rabatu","Celkem","Celkem po odečtení rabatu","Obrázek","Místo na regálu","Kat. číslo","Cílová pozice"]
[1,"S-74001","Lopata na písek","ks",4,751.3,{"$f":"F5-(F5*$I$3)","v":751.3},{"$f":"F5*E5","v":3005.2},{"$f":"H5-(H5*$I$3)","v":3005.2},null,"R14","R-91817","SYSTÉMOVÁ HRAZDA"]
[2,"S-74003","Rýč rovný","ks",8,726.5,{"$f":"F6-(F6*$I$3)","v":726.5},{"$f":"F6*E6","v":5812},{"$f":"H6-(H6*$I$3)","v":5812},null,"R14","R-91817","SYSTÉMOVÁ HRAZDA"]
[3,"S-74005","Rýč špičatý","ks",4,726.5,726.5,2906,2906,null,"R14","R-91817","SYSTÉMOVÁ HRAZDA"]
[4,"S-74007","Vidle rycí","ks",4,886.5,886.5,3546,3546,null,"R14","R-91817","SYSTÉMOVÁ HRAZDA"]
[5,"S-74009","Hrábě ERGO","ks",4,644.70000000000005,644.70000000000005,2578.8000000000002,2578.8000000000002,null,"R14","R-91817","SYSTÉMOVÁ HRAZDA"]
[6,"S-76317","Rukavice nylonové 8 \"NITRILE FLEX PVC DOTS\"","pár",12,111.6,111.6,1339.1999999999998,1339.1999999999998,null,"R14","R-90265","HÁČEK"]
{"$rows_left_out":25}